program: Gaussian 09
title: 000292684
version: EM64L-G09RevD.01
frameworkgroup: C1[X(C18H19N3O2S)]
method: RPBEPBE
basis: SDD
operation: Freq
keyword: #p
keyword: freq=noraman
keyword: PBEPBE/SDD
title: #p freq=noraman PBEPBE/SDD
converged: YES YES NO NO
title: Mulliken charges:
elementType: S O O N N N C C C C C C C C C C C C C C C C C C H H H H H H H H H H H H H H H H H H H
charge: 0.757126 -0.568960 -0.371095 -0.150348 -0.037609 -0.207501 0.156358 0.252652 0.364819 -0.031835 -0.451646 -0.338087 -0.383056 -0.644576 -0.822276 -0.245495 -0.279027 -0.162521 -0.201067 -0.223392 0.452894 -0.399860 -0.335221 -0.801428 0.323572 0.248985 0.240401 0.233843 0.277574 0.231893 0.231397 0.237051 0.240540 0.226770 0.228392 0.236171 0.246209 0.291308 0.238740 0.238809 0.236471 0.226713 0.236310
chargesum: 0.00000
title: Mulliken charges with hydrogens summed into heavy atoms:
elementType: S O O N N N C C C C C C C C C C C C C C C C C C
charge: 0.757126 -0.568960 -0.371095 -0.150348 -0.037609 0.028670 0.156358 0.252652 0.364819 -0.031835 -0.128074 -0.089102 -0.142655 0.098734 -0.113287 -0.018725 -0.050635 -0.162521 0.045142 0.067916 0.452894 -0.161120 -0.096412 -0.101934
polarizability: 3.99775372e+02 -2.45444968e+01 2.39926715e+02 -1.68677225e-01 1.76372504e+01 2.23180052e+02
1716.lowfreq: -12.0490 -6.3935 0.0010 0.0021 0.0023 2.0947 7.9057 18.7348 28.3654
frequency: 5.5892 18.6278 28.2569 33.2707 41.9828 50.3839 89.7404 102.6826 115.5294 131.0728 143.7927 148.2719 172.1466 197.9377 202.7655 220.1294 240.9650 255.7068 274.2901 278.5614 295.9151 326.3545 331.4979 340.4794 351.9793 372.2777 403.0314 413.9517 424.5863 434.3556 450.3984 468.7119 500.1810 510.2982 521.5877 546.0181 577.4409 587.3021 597.9033 625.5047 631.0998 686.7324 710.8357 739.4075 753.9879 762.2071 780.7374 793.7657 819.0332 844.2670 851.8153 854.7373 856.4424 878.3524 940.1368 945.5212 956.3398 975.5211 979.3246 987.4321 991.4044 999.6714 1019.1524 1044.9735 1045.8663 1048.3362 1052.2611 1060.7702 1081.9025 1116.6445 1117.3675 1152.6939 1172.9434 1181.1538 1183.3495 1217.8912 1244.5113 1272.0101 1294.2291 1302.5873 1339.8373 1351.8407 1367.2964 1376.0828 1395.1011 1397.4921 1399.7003 1402.2621 1435.8872 1455.1196 1468.7860 1469.9229 1472.4365 1474.8230 1474.8752 1475.2668 1485.8577 1496.4313 1510.7341 1564.7849 1587.7833 1599.7705 1612.2981 1648.1552 2792.9483 2979.6465 2980.8934 2981.9865 3056.9529 3059.1060 3059.5044 3090.7956 3097.5225 3125.6112 3131.0651 3131.8460 3132.0633 3143.9156 3145.0935 3148.0253 3153.5265 3164.6878 3179.5118
redmass: 4.5536 5.0873 3.9855 1.1257 4.6154 5.2214 4.7565 4.7372 3.6384 4.4267 6.2033 4.1136 5.3886 1.9128 1.5961 1.4203 4.7771 3.0395 5.1575 3.2105 5.7187 4.8663 3.3784 4.0343 4.7315 5.0453 2.8488 3.3440 6.2764 6.0757 7.7420 5.8449 2.9567 4.7777 3.7462 3.8892 4.5573 4.9956 4.4235 6.9315 4.3084 5.2877 3.3092 4.5270 1.3639 3.7508 4.8623 4.0858 1.3687 2.9567 4.4103 2.0253 1.3122 1.5539 1.3744 1.9496 1.3409 1.3188 2.2386 1.4845 1.3435 4.0312 1.9229 2.5271 1.6188 1.5830 2.5805 2.6401 3.3667 1.2833 1.3090 1.5743 2.0062 1.1341 1.1475 2.9805 2.0284 1.9227 1.2771 2.3580 1.8042 1.9490 2.5412 3.9678 3.7128 1.3271 1.2730 5.3717 1.4112 1.8367 1.0491 1.0464 1.0547 1.1010 1.7599 1.3001 1.6920 1.5958 5.8022 6.1857 6.7164 6.0204 6.0934 7.2783 1.0664 1.0377 1.0375 1.0374 1.0973 1.1027 1.0974 1.0988 1.0985 1.0877 1.0877 1.0879 1.0895 1.0900 1.0962 1.0959 1.0974 1.0965 1.0958
irintensity: 0.1628 0.2327 1.2595 0.7527 0.3931 1.2186 0.4522 0.1027 2.3538 1.9499 1.4029 3.3188 18.6708 0.2264 1.1382 2.3653 5.9637 11.1823 2.8987 1.0942 10.1842 1.6422 2.3473 49.6702 5.0050 1.8046 0.0336 6.0053 29.5325 11.0184 7.0449 7.7084 37.5430 5.3153 1.1909 6.6079 8.7460 12.4435 4.3378 0.5552 7.8211 2.4896 1.1315 40.6924 89.5750 1.1795 0.4215 18.1921 44.9943 63.6473 41.1252 12.3598 17.4702 56.4998 3.4056 45.2292 1.7607 0.3153 57.1295 1.6077 3.5370 6.2304 29.0879 23.6360 9.7394 14.1066 30.0351 6.4465 18.1362 12.8391 0.5120 11.0814 0.8928 2.8137 15.9331 6.4195 12.5322 15.2900 3.7064 9.7103 83.2269 122.5514 39.8345 2.3301 6.9992 19.8238 13.9881 8.3407 9.5782 19.8777 13.8024 13.3841 21.5400 10.4136 15.9518 17.5365 114.0085 1.7462 24.7049 20.5388 1.2996 23.2154 29.4033 94.9151 33.6775 26.1920 30.7899 49.5091 13.6644 25.9071 16.9492 18.3808 15.9262 9.8254 8.6294 0.6155 5.2333 12.6596 17.1742 3.0934 15.0036 34.2005 16.6849
temp: 298.150 k
press: 1.00000 atm
elementType: 16 8 8 7 7 7 6 6 6 6 6 6 6 6 6 6 6 6 6 6 6 6 6 6 1 1 1 1 1 1 1 1 1 1 1 1 1 1 1 1 1 1 1
symmnumber: 1
zpe: 867269.5 jmol-1
zpe.correction: 0.330326 hartree
zpe.thermalcorrener: 0.354237 hartree
zpe.thermalcorrenthalpy: 0.355181 hartree
zpe.thermalcorrgfe: 0.273293 hartree
zpe.sumelectzpe: -1408.205134 hartree
zpe.sumelectthermal: -1408.181223 hartree
zpe.sumelectthermalent: -1408.180279 hartree
zpe.sumelectthermalfe: -1408.262167 hartree
dipole: -1.3070 -4.9810 0.7570
dipole: 5.2050
quadrupole: -120.7855 -159.7561 -134.6326
quadrupole: 5.3064 3.4602 9.7429
quadrupole: 17.6059 -21.3647 3.7588 5.3064 3.4602 9.7429
hfenergy: -1408.53546 hartree
pointgroup: C01 [X(C18H19N3O2S1)]
dipole: -0.3679308 -1.7102834 -1.064463 debye
polarizability: 399.926591|-23.6309595|216.8575454|10.6553785|8.5135256|246.0980033 unknown
InChI: InChI=1S/C18H19N3O2S/c1-13-8-10-15(11-9-13)24(22)23-18(20-19)12-14(2)16-6-4-5-7-17(16)21(18)3/h4-12,19H,1-3H3
charge 0 multiplicity 1
43 atoms
S  -1.821263 2.532889 0.262815
O  -1.990031 2.453255 1.896789
O  -0.334035 1.301631 -0.219569
N  1.992694 1.312641 -0.571932
N  0.954416 3.272232 0.453303
N  1.436581 3.805153 1.5001
C  3.054556 0.456163 -0.253559
C  3.163666 -0.121111 1.063052
C  2.129388 0.175195 2.058999
C  0.948112 1.653875 0.377195
C  1.10608 1.026022 1.725161
C  4.047489 0.146516 -1.229665
C  4.260896 -0.977982 1.345836
C  1.873177 1.879973 -1.931042
C  2.175277 -0.476356 3.426651
C  5.123158 -0.702281 -0.912876
C  5.239077 -1.27189 0.37916
C  -3.051309 1.266781 -0.372352
C  -3.198555 1.067844 -1.757562
C  -3.826736 0.570419 0.571762
C  -4.962038 -0.590118 -1.284551
C  -4.159285 0.132853 -2.20516
C  -4.780313 -0.356825 0.106397
C  -5.996446 -1.590905 -1.766566
H  0.270904 1.221347 2.408064
H  3.983194 0.570191 -2.234461
H  4.343585 -1.419266 2.344441
H  2.750468 2.507215 -2.173617
H  0.971719 2.504362 -1.967846
H  1.778895 1.075104 -2.683006
H  3.109445 -0.225799 3.963749
H  2.129888 -1.578679 3.345605
H  1.32656 -0.144571 4.046656
H  5.875419 -0.921357 -1.678975
H  6.078174 -1.931776 0.621016
H  1.740117 3.079826 2.240416
H  -2.577443 1.612775 -2.476733
H  -3.669012 0.764169 1.639314
H  -4.283152 -0.038281 -3.280604
H  -5.392931 -0.909147 0.829064
H  -7.015936 -1.290226 -1.459929
H  -5.990024 -1.687191 -2.865393
H  -5.811922 -2.593268 -1.337347
