program: Gaussian 09
title: 000292549
version: EM64L-G09RevD.01
frameworkgroup: C1[X(C12H15N3O4)]
method: RPBEPBE
basis: SDD
operation: Freq
keyword: #p
keyword: freq=noraman
keyword: PBEPBE/SDD
title: #p freq=noraman PBEPBE/SDD
converged: YES YES NO NO
title: Mulliken charges:
elementType: O O O O N N N C C C C C C C C C C C C H H H H H H H H H H H H H H H
charge: -0.193211 -0.209180 -0.219300 -0.211813 -0.121268 -0.003707 0.016024 -0.009275 -0.439479 -0.453280 -0.394508 -0.412930 -0.737246 0.379659 0.250424 -0.303430 -0.511610 -0.415964 0.431768 0.268414 0.188880 0.229807 0.217592 0.247422 0.223491 0.207997 0.230440 0.220246 0.202395 0.223564 0.229408 0.247844 0.330387 0.290442
chargesum: 0.00000
title: Mulliken charges with hydrogens summed into heavy atoms:
elementType: O O O O N N N C C C C C C C C C C C C
charge: -0.193211 -0.209180 -0.219300 -0.211813 -0.121268 -0.003707 0.016024 0.259138 -0.020792 0.011734 0.036980 0.037757 -0.081879 0.379659 0.250424 -0.055586 -0.181223 -0.125522 0.431768
polarizability: 3.02286362e+02 -2.91200666e+00 1.84805600e+02 -4.77559131e+00 -1.38392915e+00 9.67481500e+01
1716.lowfreq: -10.5051 -4.0655 0.0004 0.0005 0.0007 6.3220 32.8457 50.0847 59.1130
frequency: 32.8042 50.0644 59.0983 67.9864 91.0186 124.4302 149.6895 154.2995 189.7995 192.3588 212.4052 251.5921 272.1603 281.0931 315.6786 347.2772 360.7772 382.7643 411.7638 422.0471 447.0689 456.1232 502.3145 504.4434 526.2310 601.3292 636.7917 642.0972 672.6376 705.9221 724.7899 739.3198 752.5399 791.1625 820.7189 844.8876 867.1823 876.8432 902.1627 916.0435 959.1652 962.9006 985.1177 985.8413 987.6146 1052.0703 1075.5707 1096.2701 1105.7042 1118.5599 1138.8468 1145.8456 1154.4385 1186.2790 1194.2501 1215.3255 1234.0261 1244.8506 1271.7641 1278.2641 1300.8339 1312.2883 1340.2248 1343.8826 1350.7918 1356.0686 1360.0305 1365.5826 1381.4207 1389.8296 1393.7414 1446.4059 1458.5610 1461.0944 1466.1072 1474.6970 1476.2493 1481.7316 1508.8383 1562.6502 1616.5018 2916.7590 2939.8583 2959.5934 2971.2040 2994.5995 3022.8588 3040.9537 3057.8101 3067.0906 3078.0211 3085.7532 3116.6350 3170.4158 3186.9404 3189.3496
redmass: 5.8582 7.0245 7.4691 4.8418 5.4024 3.7764 6.3044 5.7003 1.1173 3.0695 5.4225 4.6128 3.1011 2.4481 5.1599 5.4873 3.0829 4.2996 3.0405 4.4975 2.6336 3.3954 2.7170 6.1971 3.4515 5.2618 7.0169 5.6540 7.8242 8.2984 4.3024 4.0550 11.8748 2.3904 1.5498 1.5224 5.3286 1.4968 2.3741 2.8044 1.4368 1.8114 2.0664 1.3320 1.4972 2.2859 1.7597 2.6983 3.6442 3.6575 2.0605 1.4072 1.5615 4.9500 2.1922 4.5721 1.5303 1.5350 1.4945 1.2194 1.3016 1.2781 1.4534 4.2863 1.6039 5.0491 1.6650 1.4172 4.4726 1.6917 1.6067 4.4900 1.0868 1.1213 1.0960 1.0879 1.0611 1.1113 3.3605 9.0809 6.9350 1.0721 1.0690 1.0648 1.0374 1.0610 1.0846 1.0961 1.1025 1.0973 1.0994 1.0933 1.0892 1.0876 1.0922 1.0963
irintensity: 0.2376 0.3047 0.4863 1.1086 1.7749 1.6315 0.9669 6.9623 0.2164 1.4003 0.5432 0.2125 1.3245 1.3515 0.6388 0.8787 2.6090 12.4401 2.7113 0.5720 3.9334 1.2443 0.1759 3.2590 8.9383 4.1916 9.7216 13.8838 28.0028 6.9338 3.1882 1.5826 6.6194 0.4981 32.8766 33.1746 3.6196 1.6931 6.9408 28.6716 20.5952 25.2266 21.7674 4.4028 2.1147 31.0345 3.7287 4.0751 10.0824 4.5875 19.0168 17.3003 4.9033 282.6206 150.9579 571.6857 33.5815 102.0592 13.2387 5.6996 0.2618 3.1321 8.2544 115.9282 20.5403 33.0939 24.8648 10.5965 26.6890 0.8991 36.5831 4.9182 12.5494 48.7444 6.0750 9.4547 22.6099 51.1680 86.6094 49.2283 334.6486 40.0749 61.5403 41.9137 43.1476 29.3946 17.1605 32.8570 28.3233 56.8405 31.0966 19.7740 11.0675 2.6261 9.8982 11.9005
temp: 298.150 k
press: 1.00000 atm
elementType: 8 8 8 8 7 7 7 6 6 6 6 6 6 6 6 6 6 6 6 1 1 1 1 1 1 1 1 1 1 1 1 1 1 1
symmnumber: 1
zpe: 695854.5 jmol-1
zpe.correction: 0.265037 hartree
zpe.thermalcorrener: 0.282248 hartree
zpe.thermalcorrenthalpy: 0.283192 hartree
zpe.thermalcorrgfe: 0.219466 hartree
zpe.sumelectzpe: -929.839544 hartree
zpe.sumelectthermal: -929.822333 hartree
zpe.sumelectthermalent: -929.821388 hartree
zpe.sumelectthermalfe: -929.885114 hartree
dipole: 7.8533 -5.2903 1.0976
dipole: 9.5324
quadrupole: -135.8538 -115.0972 -111.2205
quadrupole: -3.3607 3.6913 2.4059
quadrupole: -15.1300 5.6266 9.5034 -3.3607 3.6913 2.4059
hfenergy: -930.1045808 hartree
pointgroup: C01 [X(C12H15N3O4)]
dipole: 3.0917491 -1.5067499 -1.4952641 debye
polarizability: 302.4229241|-2.4215737|121.0419123|-0.763768|39.4516694|160.375276 unknown
InChI: InChI=1S/C12H15N3O4/c1-9-3-2-6-13(8-9)11-5-4-10(14(16)17)7-12(11)15(18)19/h4-5,7,9H,2-3,6,8H2,1H3
charge 0 multiplicity 1
34 atoms
O  -0.439044 1.608147 2.670182
O  1.221474 1.830897 1.125539
O  -4.959529 -0.780929 -0.991789
O  -4.774204 0.436768 0.935674
N  1.424495 -0.6389 -0.435542
N  0.113674 1.302596 1.541404
N  -4.260918 -0.192312 -0.07206
C  3.628821 -0.052155 0.659843
C  4.35348 -0.510101 -0.628854
C  2.282304 -0.803703 0.769473
C  3.442741 -0.337628 -1.862229
C  2.092671 -1.072827 -1.688964
C  4.479208 -0.301315 1.921396
C  0.060561 -0.414794 -0.378738
C  -0.601887 0.366706 0.647557
C  -0.81244 -1.024153 -1.350579
C  -2.005079 0.40947 0.765047
C  -2.20132 -0.948108 -1.266076
C  -2.798608 -0.248358 -0.185427
H  3.40309 1.027318 0.580527
H  4.647352 -1.576466 -0.523614
H  5.287355 0.067443 -0.762148
H  2.495788 -1.89395 0.865406
H  1.734899 -0.504801 1.673515
H  3.241618 0.737713 -2.028458
H  3.935402 -0.729294 -2.772499
H  1.44641 -0.839764 -2.549507
H  2.262607 -2.172003 -1.665123
H  4.684456 -1.38077 2.062155
H  5.452472 0.216334 1.843447
H  3.973155 0.073314 2.829799
H  -0.37661 -1.633819 -2.145051
H  -2.467573 0.991558 1.566277
H  -2.84372 -1.44871 -1.995284
