program: Gaussian 09
title: 000292523
version: EM64L-G09RevD.01
frameworkgroup: C1[X(C6H7Cl3O3)]
method: RPBEPBE
basis: SDD
operation: Freq
keyword: #p
keyword: freq=noraman
keyword: PBEPBE/SDD
title: #p freq=noraman PBEPBE/SDD
converged: YES YES NO NO
title: Mulliken charges:
elementType: Cl Cl Cl O O O C C C C C C H H H H H H H
charge: 0.117573 0.158461 0.097494 -0.271598 -0.109883 -0.238292 -0.072792 0.407117 -0.686352 -0.745152 0.315676 -0.750174 0.285815 0.248455 0.229077 0.252469 0.253118 0.258813 0.250175
chargesum: 0.00000
title: Mulliken charges with hydrogens summed into heavy atoms:
elementType: Cl Cl Cl O O O C C C C C C
charge: 0.117573 0.158461 0.097494 -0.271598 -0.109883 -0.238292 0.213023 0.407117 0.043650 -0.745152 0.315676 0.011932
polarizability: 1.19406901e+02 1.11818280e+01 9.75750455e+01 -7.83959838e+00 2.26843766e+00 9.73628911e+01
1716.lowfreq: -57.2795 -16.7653 -11.0568 -0.0024 -0.0011 0.0017 3.0859 18.7227 32.7221
frequency: -57.1767 17.7134 32.1960 35.5872 95.3582 122.6591 144.9631 177.5402 187.7669 221.4810 227.0615 251.2829 256.2432 302.4612 333.3475 370.4265 391.3152 457.7655 574.0105 590.7823 597.2326 666.7966 724.9949 757.5052 810.2572 826.5679 907.3587 995.4649 1010.6198 1044.9494 1047.6089 1073.7350 1136.2276 1179.7254 1307.5057 1328.1621 1385.4434 1386.5183 1453.4348 1457.3395 1464.3995 1468.1507 1649.5508 1661.5131 3002.8636 3009.3889 3061.1736 3099.1586 3100.9401 3122.9167 3143.6579
redmass: 1.0323 6.8362 8.7335 10.5066 3.7349 6.5020 14.2469 5.6194 7.6826 1.3922 2.7819 9.0946 21.7294 6.5184 9.8886 3.7376 17.0065 3.5836 3.3963 5.0546 12.0211 4.9457 7.3572 8.7840 4.3498 4.2316 5.3039 1.8295 3.0417 1.7006 3.2697 1.5607 2.5750 3.3606 1.3129 1.4492 1.2107 1.2149 1.0627 1.0486 1.0519 1.0433 11.6485 10.5799 1.0357 1.0374 1.0862 1.0959 1.0983 1.1019 1.1016
irintensity: 0.9071 0.5827 1.2004 1.8163 5.2403 3.5837 1.4422 4.0252 0.6655 0.8141 3.1843 0.6330 0.1468 1.3214 2.0909 9.4146 6.8173 29.2478 7.3822 12.8303 106.8406 50.6725 34.6684 158.1077 32.7807 11.1893 50.2562 35.1990 37.3330 18.1653 36.6058 63.9454 1.2701 298.0803 8.2733 7.0486 46.0350 27.7707 14.3303 17.9068 13.6362 16.0752 222.5335 45.0418 8.0388 1.4325 7.4533 4.2595 17.6346 4.9696 5.6911
temp: 298.150 k
press: 1.00000 atm
elementType: 17 17 17 8 8 8 6 6 6 6 6 6 1 1 1 1 1 1 1
symmnumber: 1
zpe: 321024.6 jmol-1
zpe.correction: 0.122272 hartree
zpe.thermalcorrener: 0.136022 hartree
zpe.thermalcorrenthalpy: 0.136966 hartree
zpe.thermalcorrgfe: 0.078703 hartree
zpe.sumelectzpe: -1837.735823 hartree
zpe.sumelectthermal: -1837.722074 hartree
zpe.sumelectthermalent: -1837.721129 hartree
zpe.sumelectthermalfe: -1837.779392 hartree
dipole: -1.6032 -0.0322 -0.1825
dipole: 1.6138
quadrupole: -87.0129 -85.3502 -98.2916
quadrupole: 2.1148 7.9089 4.2701
quadrupole: 3.2053 4.8680 -8.0734 2.1148 7.9089 4.2701
hfenergy: -1837.8580953 hartree
pointgroup: C01 [X(C6H7Cl3O3)]
dipole: -0.6322611 -0.0096139 -0.0574181 debye
dipolederiv: -0.3323697 -0.2092246 0.1232992 -0.2134193 -0.488905 0.2003878 0.1394573 0.22648 -0.2381485 -0.5702325 0.1968978 0.2698645 0.2086877 -0.1843579 -0.1237948 0.2924518 -0.1330223 -0.2544818 -0.2693074 -0.106007 -0.1460422 -0.0839803 -0.4429013 -0.2618034 -0.1696442 -0.2993948 -0.4352447 -1.2787385 -0.3925989 0.376807 -0.3307823 -0.5620524 0.0863191 0.449333 0.0938068 -0.5712392 -0.48592 0.0914286 0.0447119 0.1038859 -0.3072065 0.1557316 0.070371 0.1723279 -0.7089214 -0.5973548 -0.1508507 0.0424342 -0.0195241 -0.4449398 -0.2454614 0.3716479 -0.0666021 -0.8453112 0.324704 0.1169285 0.0146321 0.2383146 0.4238055 -0.0330375 0.1260005 0.0655493 0.1177411 0.8630168 -0.3140688 0.0738978 -0.3663334 0.1677173 -0.28337 0.1206321 -0.3544569 0.7576875 -0.1191243 0.0773422 0.0041238 -0.0384363 -0.1061337 0.0296111 0.0114241 0.0024746 0.0377112 0.9777649 0.2957949 -0.4243231 0.2624882 1.1127619 0.2947105 -0.4448916 0.3315866 0.8236287 1.3834285 0.5927562 -0.3398298 0.4905318 0.6366892 0.2345648 -0.8477988 0.0004997 1.1689233 -0.2063899 -0.2035089 -0.0685645 -0.2390872 -0.203842 -0.096843 0.0149417 -0.0422428 -0.0327083 0.0763189 -0.0249449 -0.0074546 -0.0265548 0.0222961 0.0477447 -0.1008376 0.0095442 -0.0104516 -0.0541951 0.0722955 0.0608534 0.0551297 0.0710761 0.0032451 0.0666572 0.0013233 0.0700159 0.000199 -0.1101108 -0.0606657 -0.1111552 0.0171441 -0.0157428 -0.0550758 -0.0381774 0.0746868 0.1217691 0.0106549 0.0020012 0.0131864 0.0830666 -0.0265212 -0.032009 0.0441801 -0.0619415 0.1113642 0.0312199 -0.0319765 -0.0087418 -0.0103902 0.0602526 -0.043116 0.073909 0.0613224 0.110329 -0.0047236 0.0533935 -0.00139 0.1217945 -0.0047302 0.0127317 -0.0377859 -0.0583767 -0.0552621 0.0307198 0.0128378 0.0671805 0.0943775 -0.021263 0.0177249 -0.0499992 0.1051081 unknown
polarizability: 119.5954135|8.6856562|97.9957768|-10.3422819|2.1675502|96.7536473 unknown
InChI: InChI=1S/C6H7Cl3O3/c1-3(12-4(2)10)5(11)6(7,8)9/h3H,1-2H3
charge 0 multiplicity 1
19 atoms
Cl 1.041202 -1.869518 1.037635
Cl 3.3157 -1.079857 -0.796672
Cl 2.511172 0.76905 1.474722
O  -1.449261 -0.147034 -0.522059
O  1.108815 0.581898 -1.891502
O  -2.600056 0.023445 1.505449
C  -0.418249 0.804995 0.009398
C  0.870716 0.336192 -0.695766
C  -0.788174 2.240752 -0.3720
C  1.895957 -0.450701 0.178289
C  -2.504703 -0.46574 0.360459
C  -3.443734 -1.459973 -0.280933
H  -0.362369 0.677043 1.103946
H  -1.750574 2.508968 0.093805
H  -0.018865 2.945095 -0.007904
H  -0.864546 2.337969 -1.467136
H  -3.337075 -2.435652 0.226481
H  -3.225014 -1.584792 -1.350725
H  -4.485243 -1.127242 -0.139187
