program: Gaussian 09
title: 000292506
version: EM64L-G09RevD.01
frameworkgroup: C1[X(C12H29N3)]
method: RPBEPBE
basis: SDD
operation: Freq
keyword: #pfreq=noraman
keyword: PBEPBE/SDD
title: #p freq=noraman PBEPBE/SDD
converged: YES YES NO NO
title: Mulliken charges:
elementType: N N N C C C C C C C C C C C C H H H H H H H H H H H H H H H H H H H H H H H H H H H H H
charge: -0.303601 -0.303569 -0.287036 -0.026130 -0.023150 -0.378241 -0.374535 -0.369243 -0.368323 -0.376781 -0.377891 -0.713449 -0.714228 -0.688549 -0.687860 0.191239 0.194624 0.190206 0.204508 0.226961 0.162127 0.195831 0.201257 0.164631 0.227833 0.233333 0.232357 0.184624 0.192244 0.183775 0.192411 0.235183 0.201579 0.212976 0.226238 0.200620 0.214478 0.223790 0.200455 0.242693 0.206490 0.201738 0.242273 0.206109
chargesum: 0.00000
title: Mulliken charges with hydrogens summed into heavy atoms:
elementType: N N N C C C C C C C C C C C C
charge: -0.070268 -0.071212 -0.051853 0.165109 0.171474 0.016473 0.014553 0.027846 0.024141 0.000087 -0.001704 -0.072656 -0.075340 -0.038910 -0.037740
polarizability: 1.97984877e+02 -3.63753154e-01 1.41469496e+02 1.63927319e-01 -6.47054759e-01 1.32870701e+02
1716.lowfreq: -8.8153 -0.0010 -0.0005 -0.0002 5.1455 9.7785 21.2339 29.1081 40.2411
frequency: 18.5953 21.4674 39.9226 54.6901 69.1732 73.4256 106.6050 113.3843 115.1777 118.0174 140.8804 154.5182 170.6400 194.9141 202.6813 212.6364 213.8232 240.4617 251.1895 284.6729 295.5256 363.4893 375.4794 421.6206 440.9481 461.8008 470.9087 514.6291 518.8627 645.8489 657.0432 691.6305 776.3542 777.2212 805.8904 816.4200 826.8467 831.4665 900.0202 905.8515 962.2162 963.8258 982.4972 987.7440 1024.3486 1028.5515 1030.7622 1032.2389 1055.7692 1078.3893 1093.9215 1104.8812 1106.9619 1119.2366 1125.9055 1143.1500 1150.9357 1175.0581 1175.4150 1189.6923 1205.0633 1226.2348 1257.0952 1258.5420 1274.2623 1276.6561 1290.8968 1292.0559 1293.5736 1316.0792 1334.5864 1339.2029 1340.1736 1353.4047 1372.3353 1374.8172 1377.5141 1380.0931 1383.9628 1400.6030 1440.6637 1440.7143 1455.0893 1461.6902 1462.5806 1470.6329 1470.7153 1472.7980 1473.0918 1476.2268 1477.7755 1479.2414 1485.2869 1491.0042 1491.1043 1492.7427 1496.7134 2829.9163 2836.7897 2884.7316 2903.6423 2956.6502 2956.6827 2964.6164 2964.8006 2970.9113 2973.6287 2976.6279 2977.0073 2977.6117 3002.6927 3019.8269 3019.9351 3023.1478 3039.8278 3060.2183 3060.4994 3067.6903 3068.0340 3068.5126 3069.5950 3089.6158 3089.6814 3414.9304 3415.8811 3416.8469
redmass: 3.3105 3.4230 3.3923 3.4445 1.7471 3.4193 2.2069 2.2384 1.8935 2.3612 2.2682 2.9236 2.2124 1.8012 1.4739 1.0900 1.0996 1.5887 1.7199 2.6803 2.7695 2.6098 2.7312 3.0847 2.9030 1.9922 2.1712 2.9527 2.8221 1.6219 1.6036 1.2777 1.2226 1.2316 1.1744 1.4108 1.5986 1.3850 1.8704 1.8435 1.2714 1.2593 1.6513 1.6382 2.4328 2.7694 2.7574 2.8914 1.7042 1.9186 2.0526 2.4185 2.3126 2.5184 2.6770 1.5824 3.5815 2.2739 2.2332 2.0896 1.6967 1.3842 1.2398 1.2731 1.2171 1.1505 1.2282 1.2205 1.2082 1.2533 1.2649 1.5153 1.5535 1.3335 1.2897 1.2278 1.2314 1.2145 1.2898 1.4769 1.1858 1.1855 1.1887 1.0654 1.0699 1.0451 1.0457 1.0698 1.0652 1.0791 1.0877 1.0691 1.0748 1.0576 1.0579 1.0945 1.0844 1.0721 1.0710 1.0687 1.0658 1.0667 1.0647 1.0410 1.0389 1.0728 1.0769 1.0379 1.0376 1.0867 1.0956 1.0979 1.0977 1.0835 1.0907 1.0991 1.0990 1.0994 1.0995 1.0993 1.0993 1.0995 1.0995 1.0735 1.0735 1.0736
irintensity: 0.3136 0.1599 0.1405 0.1592 1.8365 0.2384 0.2340 2.2104 1.3836 0.4479 1.8597 0.2863 5.6905 0.1750 1.1881 0.3456 0.8825 3.0458 0.0996 0.4489 2.2476 1.0578 1.7855 1.6276 6.5327 12.0438 0.8726 7.2339 5.5662 178.2361 36.4075 64.1266 16.0027 13.2942 3.3219 4.3153 6.1615 1.4236 2.7287 0.4035 18.3691 4.3918 3.6559 35.3865 5.8279 2.2576 9.0404 2.9255 7.8383 8.1445 10.5821 21.3288 16.0126 11.8792 61.4118 9.1659 69.1745 96.3073 0.7310 11.5889 1.1566 4.5619 0.8007 0.7012 2.1393 0.1938 2.0780 1.4114 16.8376 1.1651 13.4655 7.5802 1.5881 1.1147 36.2541 10.1576 4.2733 15.4983 17.2877 0.5854 7.4093 42.5800 51.4459 4.5902 10.0825 5.0564 6.0726 0.9383 2.8180 8.7585 17.2739 10.0360 1.8564 13.7654 8.4860 7.0514 4.5037 160.3691 77.5791 30.2326 142.4177 11.4138 9.8851 25.1942 30.9219 64.0877 57.7124 31.9570 31.5545 3.0232 81.2565 37.7253 22.3902 15.5244 45.8442 40.0234 39.7779 74.9123 81.3964 45.3244 42.8566 65.3450 15.9044 2.1611 1.4970 3.2059
temp: 298.150 k
press: 1.00000 atm
elementType: 7 7 7 6 6 6 6 6 6 6 6 6 6 6 6 1 1 1 1 1 1 1 1 1 1 1 1 1 1 1 1 1 1 1 1 1 1 1 1 1 1 1 1 1
symmnumber: 1
zpe: 1054580.0 jmol-1
zpe.correction: 0.401668 hartree
zpe.thermalcorrener: 0.422353 hartree
zpe.thermalcorrenthalpy: 0.423297 hartree
zpe.thermalcorrgfe: 0.350015 hartree
zpe.sumelectzpe: -637.607141 hartree
zpe.sumelectthermal: -637.586456 hartree
zpe.sumelectthermalent: -637.585512 hartree
zpe.sumelectthermalfe: -637.658795 hartree
dipole: -0.0290 0.7236 -0.8133
dipole: 1.0890
quadrupole: -94.5460 -99.0957 -96.4281
quadrupole: -0.0490 -6.1236 -1.8959
quadrupole: 2.1439 -2.4058 0.2619 -0.0490 -6.1236 -1.8959
hfenergy: -638.0088092 hartree
pointgroup: C01 [X(C12H29N3)]
dipole: 0.0133515 -0.3303974 0.2724628 debye
polarizability: 197.9821447|0.3156533|132.932678|0.4789089|-0.9656831|141.4102516 unknown
InChI: InChI=1S/C12H29N3/c1-5-11(3)14-9-7-13-8-10-15-12(4)6-2/h11-15H,5-10H2,1-4H3
charge 0 multiplicity 1
44 atoms
N  3.706612 0.294359 -0.232446
N  -3.707842 -0.291703 -0.253046
N  0.001295 -0.090303 0.433223
C  5.000679 0.1187 0.476179
C  -5.0019 -0.110768 0.453289
C  2.473772 0.14391 0.568039
C  -2.477198 -0.177033 0.552358
C  1.24395 0.045872 -0.356526
C  -1.241387 -0.111584 -0.365374
C  6.142772 0.008665 -0.566302
C  -6.138436 0.030798 -0.591092
C  5.305041 1.230452 1.519084
C  -5.325216 -1.23689 1.475355
C  6.026912 -1.236661 -1.46853
C  -6.005878 1.290567 -1.470876
H  4.932688 -0.851747 1.012142
H  -4.923427 0.848761 1.006543
H  2.567899 -0.795104 1.152431
H  2.291573 0.963484 1.302435
H  -2.530048 0.754785 1.145425
H  -2.335434 -1.013985 1.285464
H  1.162465 0.975983 -0.956069
H  1.412119 -0.788546 -1.07996
H  -1.279572 -0.966411 -1.091874
H  -1.294254 0.81471 -0.966822
H  3.701015 1.168001 -0.779983
H  -3.713414 -1.146878 -0.828733
H  6.140054 0.927885 -1.190517
H  7.1126 0.000973 -0.030058
H  -6.143954 -0.877507 -1.231211
H  -7.110016 0.040284 -0.05814
H  0.049092 -0.902527 1.066088
H  5.442682 2.207609 1.015697
H  6.230546 1.006246 2.082624
H  4.481253 1.334999 2.248779
H  -5.469843 -2.204105 0.954802
H  -6.252347 -1.011744 2.035684
H  -4.509091 -1.362145 2.210585
H  6.142556 -2.164576 -0.876541
H  5.032367 -1.263554 -1.946514
H  6.802297 -1.239144 -2.256794
H  -6.112687 2.208996 -0.862813
H  -5.009926 1.315688 -1.945974
H  -6.77897 1.315792 -2.26103
