program: Gaussian 09
title: 000292485
version: EM64L-G09RevD.01
frameworkgroup: C1[X(C5H8N4O2)]
method: RPBEPBE
basis: SDD
operation: Freq
keyword: #pfreq=noraman
keyword: PBEPBE/SDD
title: #p freq=noraman PBEPBE/SDD
converged: NO NO NO NO
title: Mulliken charges:
elementType: O O N N N N C C C C C H H H H H H H H
charge: -0.225278 -0.309482 -0.278803 -0.018194 -0.138177 -0.606893 -0.225450 0.248782 0.339644 -0.664824 -0.267919 0.234587 0.234591 0.212285 0.237989 0.237989 0.263894 0.342039 0.383218
chargesum: 0.00000
title: Mulliken charges with hydrogens summed into heavy atoms:
elementType: O O N N N N C C C C C
charge: -0.225278 -0.309482 -0.278803 -0.018194 -0.138177 0.118364 0.243728 0.248782 0.339644 0.023440 -0.004025
polarizability: 1.20857381e+02 6.34912807e-01 9.91909224e+01 5.54761262e-04 1.50395361e-03 4.73297311e+01
1716.lowfreq: -29.8725 0.0006 0.0008 0.0011 5.7942 10.3415 23.5179 82.2860 109.9279
frequency: -15.4699 82.2350 109.9150 112.8182 175.6772 245.0613 255.8670 296.5185 305.3173 382.3516 438.2155 501.6229 504.7676 602.3832 641.0706 692.3841 712.2541 723.9389 788.5955 797.5642 822.8438 866.0217 903.8703 998.9674 1012.2603 1060.6539 1112.2848 1115.0730 1135.3069 1191.9757 1227.9589 1249.7481 1313.4959 1337.9516 1391.2025 1404.4912 1432.5404 1461.0023 1472.3407 1485.2705 1510.9563 1608.7609 1646.3817 3000.4839 3015.6198 3077.6281 3097.1286 3116.8927 3247.1287 3482.5011 3676.2904
redmass: 2.3605 4.0761 4.1248 4.2989 4.8906 1.2954 4.2110 5.1318 5.0796 3.6197 5.7516 1.1670 5.2405 2.5008 1.3824 8.8442 7.1028 10.7004 6.1392 1.0999 4.7287 1.3628 9.7844 2.4585 2.1056 4.8766 8.1971 2.4021 1.4557 2.6887 2.2941 1.1342 2.6458 2.2607 2.0061 1.6050 3.7115 1.0396 1.0670 1.0884 1.9674 2.1443 8.9796 1.0361 1.0579 1.1074 1.0982 1.1029 1.0985 1.0502 1.1007
irintensity: 0.0884 4.6143 1.5280 0.6663 0.5709 1.0077 8.6813 4.2249 9.6373 19.4281 1.9694 176.2166 1.9195 21.7622 123.2758 5.0744 9.9618 36.0612 1.5978 3.8546 9.6684 18.3403 23.3376 16.6806 51.1671 63.4425 248.8518 34.3720 5.9475 72.8688 17.7234 0.0070 195.3492 169.7994 327.9927 63.4124 118.8131 12.7490 2.1008 33.6429 73.3719 37.2916 515.9630 16.2897 18.0730 7.9571 24.7429 36.6031 2.8901 98.9232 104.9737
temp: 298.150 k
press: 1.00000 atm
elementType: 8 8 7 7 7 7 6 6 6 6 6 1 1 1 1 1 1 1 1
symmnumber: 1
zpe: 375888.1 jmol-1
zpe.correction: 0.143168 hartree
zpe.thermalcorrener: 0.152907 hartree
zpe.thermalcorrenthalpy: 0.153851 hartree
zpe.thermalcorrgfe: 0.107839 hartree
zpe.sumelectzpe: -563.943106 hartree
zpe.sumelectthermal: -563.933367 hartree
zpe.sumelectthermalent: -563.932423 hartree
zpe.sumelectthermalfe: -563.978435 hartree
dipole: 2.1466 2.2286 0.0000
dipole: 3.0943
quadrupole: -55.5974 -62.5941 -64.5066
quadrupole: -4.4356 0.0007 -0.0020
quadrupole: 5.3019 -1.6947 -3.6072 -4.4356 0.0007 -0.0020
hfenergy: -564.0862744 hartree
pointgroup: C01 [X(C5H8N4O2)]
dipole: 0.8556168 0.8660095 0.000012 debye
dipolederiv: -1.8501198 0.2157716 -0.0000316 0.5434675 -0.477606 -0.0000208 -0.0000567 -0.0000073 -0.2648152 -0.7791284 -0.0729857 -0.0000131 -0.0946876 -0.9937141 -0.0000398 -0.0000522 -0.0001256 -0.3514057 -1.629772 -0.1681735 -0.0000435 -0.5334505 -0.4622551 -0.0000043 -0.000142 -0.0000265 -0.034263 -0.4408598 0.1979742 -0.0000559 0.3840857 -0.0355934 0.0000431 0.0001863 -0.0000461 -0.1631357 -0.5079017 -0.2893003 0.0000282 0.0434617 -1.0622126 -0.0000241 -0.0000134 0.0000269 -0.2720026 -0.4085997 0.1683659 -0.0000111 0.3725054 -1.25336 -0.0000033 0.0000025 0.0000022 -0.6605671 1.1166038 -0.0431026 0.0000327 0.1366525 0.2399136 -0.000008 0.000066 -0.0000218 0.3494151 1.0740681 0.2142119 0.0000485 -0.4798919 1.410912 -0.0000401 -0.0000054 -0.0000275 0.1955163 2.602106 0.1529808 0.0000621 -0.0362165 1.3506841 0.0000961 0.0000521 0.0001607 0.3475508 -0.1143883 0.0859093 -0.000005 0.0662732 -0.0131617 0.000007 -0.0000088 0.0000071 0.0503782 0.3208897 -0.2986855 -0.0000319 -0.1791518 0.6621087 -0.0000148 0.0000103 0.0000866 -0.0604825 -0.05736 0.0294859 -0.0250002 -0.061832 0.0025695 0.0888147 0.0102293 0.1000916 -0.0523743 -0.0573571 0.0295025 0.0250133 -0.0618133 0.0025984 -0.0888078 -0.0102335 -0.1000702 -0.0523858 -0.1388453 -0.0662605 -0.0000241 -0.0857254 0.0436448 -0.0000127 -0.0000275 -0.0000108 0.120237 0.1203107 -0.0200399 0.0361517 0.0353688 0.0181346 0.0955076 0.0123378 0.1064803 -0.0532001 0.1203187 -0.0200167 -0.0361256 0.0353883 0.0181577 -0.0954941 -0.0123017 -0.1064765 -0.0532312 0.0846267 -0.050607 0.000001 -0.0282469 0.0076087 0.0000016 -0.0000655 -0.0000507 0.1694521 0.2161362 -0.0646975 -0.0000025 -0.0449375 0.2450458 0.0000016 -0.0000067 0.0000125 0.402272 0.3292723 -0.0003328 0.000007 -0.0112496 0.2965249 -0.0000018 0.0000291 -0.0000048 0.3830419 unknown
polarizability: 120.8700083|0.3596731|99.1782951|0.0005738|0.0014968|47.3297311 unknown
InChI: InChI=1S/C5H8N4O2/c1-2-11-5(10)9-4(6)7-3-8-9/h3H,2,6H2,1H3
charge 0 multiplicity 1
19 atoms
O  1.688985 -0.328285 0.000083
O  0.663246 1.777806 0.000347
N  -0.614296 -0.171858 0.00004
N  -0.74497 -1.598922 -0.000175
N  -2.843222 -0.551853 0.000024
N  -2.107171 1.766651 0.000049
C  3.031243 0.350553 0.000256
C  -1.903254 0.420847 0.000052
C  0.610605 0.513278 0.000112
C  4.071152 -0.762514 0.000287
C  -2.090137 -1.729577 0.000122
H  3.089382 0.99306 -0.896389
H  3.089213 0.992953 0.896989
H  5.083953 -0.319809 0.000403
H  3.967492 -1.398689 0.894849
H  3.967654 -1.39859 -0.894365
H  -2.550475 -2.714728 0.000046
H  -3.064865 2.106961 0.000026
H  -1.295835 2.389917 0.000044
