program: Gaussian 09
title: 000292464
version: EM64L-G09RevD.01
frameworkgroup: C1[X(C17H16NP)]
method: RPBEPBE
basis: SDD
operation: Freq
keyword: #p
keyword: freq=noraman
keyword: PBEPBE/SDD
title: #p freq=noraman PBEPBE/SDD
converged: YES YES NO NO
title: Mulliken charges:
elementType: P N C C C C C C C C C C C C C C C C C H H H H H H H H H H H H H H H H
charge: 0.610801 -0.476127 0.166670 0.202703 -0.875456 -0.487172 -0.703183 0.161085 0.209779 -0.144428 -0.421091 -0.366048 -0.255856 -0.276613 -0.256184 -0.223403 -0.244028 -0.233551 -0.235679 0.265472 0.253290 0.240757 0.225219 0.243429 0.271204 0.299274 0.229241 0.227307 0.245487 0.226916 0.218297 0.219535 0.226595 0.226535 0.229223
chargesum: 0.00000
title: Mulliken charges with hydrogens summed into heavy atoms:
elementType: P N C C C C C C C C C C C C C C C C C
charge: 0.610801 -0.176853 0.166670 0.202703 -0.356694 -0.021195 -0.188551 0.161085 0.209779 -0.144428 -0.191850 -0.138741 -0.010370 -0.049698 -0.037886 -0.003868 -0.017433 -0.007016 -0.006455
polarizability: 3.17232505e+02 -1.02893899e+01 2.21400418e+02 7.53152991e+00 -5.36117764e-01 1.04786473e+02
1716.lowfreq: -7.0414 -0.0010 -0.0008 -0.0005 1.2240 9.5256 18.7367 43.0188 64.4922
frequency: 18.2370 43.0152 64.4860 86.5917 118.8193 165.2539 178.7645 202.7436 210.8629 265.4718 291.2161 302.8589 329.9927 370.0431 394.7479 422.6402 429.1176 478.7489 490.4742 495.3889 528.6125 575.9636 590.5561 610.3948 614.3814 627.6773 672.5581 673.3130 699.7479 708.3435 735.1665 747.2768 751.6331 757.1813 814.6575 833.9008 847.1024 849.2672 872.5001 909.2329 927.3295 939.6329 967.8141 969.1058 976.3534 986.8302 991.8950 1010.9636 1015.9610 1021.1083 1078.0760 1082.2310 1106.0692 1127.4132 1142.9253 1157.4264 1163.9109 1172.7698 1177.7185 1191.4452 1202.5671 1225.4153 1249.1887 1269.2595 1280.9970 1309.7800 1338.6312 1346.1027 1370.1073 1410.4174 1422.5715 1429.5701 1435.2409 1446.7956 1457.8756 1467.0641 1468.4254 1481.2563 1579.2568 1580.3936 1593.7036 1595.6047 1632.4914 2953.4453 2971.0036 2993.7036 3013.5729 3042.8327 3084.8420 3113.3845 3121.2423 3122.3251 3128.4113 3134.9143 3142.5627 3144.7431 3161.1002 3162.1163 3604.4312
redmass: 4.0189 4.3801 5.0510 4.5638 3.6116 4.5194 3.0860 2.9465 5.6160 3.4660 3.7344 3.1027 4.5345 5.2145 2.8016 5.5366 3.1409 4.3763 3.5405 1.2001 4.4214 3.3885 6.1659 4.0871 6.3043 4.3723 6.1011 3.7897 1.8328 5.4396 3.7018 1.3532 1.8639 3.4903 1.8139 2.3095 1.2635 1.6131 2.5278 1.3781 1.3852 2.8590 1.3004 1.4033 1.8442 5.9641 1.3144 2.0811 2.4379 3.1162 1.7322 2.4189 2.0291 1.2588 1.8527 1.2063 1.1162 1.0639 1.4006 1.1836 1.2903 1.5864 1.7553 1.3195 1.9251 1.3892 1.9138 2.1333 5.7888 4.2543 2.1764 1.7409 1.4395 1.1078 1.1856 4.3228 2.0209 3.0374 6.8199 5.7230 6.1622 5.9006 6.7757 1.0585 1.0607 1.0942 1.0647 1.0993 1.1050 1.0866 1.0847 1.0856 1.0890 1.0912 1.0950 1.0958 1.1001 1.1015 1.0803
irintensity: 0.0811 0.7108 0.0973 0.3313 1.2181 1.3602 3.0864 0.0387 1.0631 1.0024 0.8868 1.4976 2.8717 4.0760 0.0809 3.6751 5.6014 7.6110 8.5705 85.3717 4.2772 7.8247 0.5199 9.5904 0.3498 3.9609 0.1010 2.7457 49.4755 3.9535 11.1935 112.7473 30.7616 5.7200 5.3609 0.3979 0.1530 0.4426 4.8755 0.7380 2.5413 6.6511 0.0037 0.0339 1.7799 1.0811 0.0009 13.1698 3.2807 7.1203 5.9777 0.7844 10.3529 1.8765 21.2551 8.1066 6.1957 0.2352 8.1373 0.7827 3.7955 2.7177 23.9064 1.6334 2.4850 2.5997 23.7445 31.1344 0.7545 16.0577 10.4614 10.8371 10.8219 13.8748 3.7965 28.3378 28.2910 5.3627 1.2945 1.1845 11.6302 14.3368 1.7268 56.0639 24.6955 8.1282 31.7595 8.9082 18.0725 6.7065 2.7315 1.3907 3.9236 9.8831 37.5425 42.7660 39.4974 30.9784 46.5146
temp: 298.150 k
press: 1.00000 atm
elementType: 15 7 6 6 6 6 6 6 6 6 6 6 6 6 6 6 6 6 6 1 1 1 1 1 1 1 1 1 1 1 1 1 1 1 1
symmnumber: 1
zpe: 738534.1 jmol-1
zpe.correction: 0.281293 hartree
zpe.thermalcorrener: 0.297101 hartree
zpe.thermalcorrenthalpy: 0.298046 hartree
zpe.thermalcorrgfe: 0.237034 hartree
zpe.sumelectzpe: -1052.082932 hartree
zpe.sumelectthermal: -1052.067123 hartree
zpe.sumelectthermalent: -1052.066179 hartree
zpe.sumelectthermalfe: -1052.127191 hartree
dipole: -0.1851 2.2262 -1.5422
dipole: 2.7145
quadrupole: -108.8773 -100.2017 -128.7095
quadrupole: 7.0434 2.0026 -2.1888
quadrupole: 3.7189 12.3945 -16.1133 7.0434 2.0026 -2.1888
hfenergy: -1052.3642244 hartree
pointgroup: C01 [X(C17H16N1P1)]
dipole: -0.0671053 0.8904975 -0.5857148 debye
polarizability: 317.0924598|-11.2569938|221.5423123|6.6758809|2.1865571|104.7846241 unknown
InChI: InChI=1S/C17H16NP/c1-2-6-13(7-3-1)19-11-10-17-15(12-19)14-8-4-5-9-16(14)18-17/h1-9,18H,10-12H2
charge 0 multiplicity 1
35 atoms
P  -1.432713 0.628652 1.032677
N  2.730943 1.731529 -0.206246
C  1.160623 0.099361 0.090521
C  1.35375 1.476594 -0.064624
C  -0.1698 -0.595202 0.261069
C  0.330256 2.584863 -0.072062
C  -1.105402 2.033681 -0.245916
C  2.472334 -0.523505 0.04375
C  3.441356 0.526277 -0.14291
C  -3.065164 -0.035247 0.346867
C  2.924108 -1.865434 0.141601
C  4.826035 0.269283 -0.23315
C  -3.246297 -1.399756 0.001162
C  -4.182648 0.838343 0.265023
C  4.305716 -2.12924 0.053322
C  5.246643 -1.073838 -0.132284
C  -4.506395 -1.874244 -0.431506
C  -5.439467 0.367554 -0.175062
C  -5.60676 -0.992566 -0.526422
H  -0.562974 -0.962043 -0.708168
H  -0.068415 -1.464726 0.935818
H  0.391672 3.164711 0.872354
H  0.543399 3.299444 -0.894201
H  -1.84638 2.83507 -0.083308
H  -1.250791 1.625118 -1.2625
H  3.141571 2.654196 -0.332529
H  2.211294 -2.686122 0.282328
H  5.553858 1.07645 -0.37462
H  -2.409254 -2.10377 0.068868
H  -4.078066 1.892022 0.55287
H  4.668423 -3.160573 0.127838
H  6.314644 -1.310406 -0.197064
H  -4.626039 -2.931713 -0.694052
H  -6.287282 1.059426 -0.237457
H  -6.582376 -1.35989 -0.863788
