program: Gaussian 09
title: 000292446
version: EM64L-G09RevD.01
frameworkgroup: C1[X(C14H19NO5)]
method: RPBEPBE
basis: SDD
operation: Freq
keyword: #p
keyword: freq=noraman
keyword: PBEPBE/SDD
title: #p freq=noraman PBEPBE/SDD
converged: YES YES NO NO
title: Mulliken charges:
elementType: O O O O O N C C C C C C C C C C C C C C H H H H H H H H H H H H H H H H H H H
charge: -0.453970 -0.461521 -0.293017 -0.268342 -0.333626 -0.378344 -0.090922 -0.420776 -0.354611 0.385304 0.275070 0.151775 -0.228839 -0.517328 -0.385547 0.324014 -0.356885 -0.343996 -0.521773 -0.536599 0.207021 0.211251 0.263779 0.231413 0.225924 0.315777 0.297389 0.250833 0.217098 0.248919 0.374524 0.246303 0.337640 0.240943 0.232559 0.217648 0.247303 0.220827 0.222783
chargesum: 0.00000
title: Mulliken charges with hydrogens summed into heavy atoms:
elementType: O O O O O N C C C C C C C C C C C C C C
charge: -0.079446 -0.123881 -0.293017 -0.268342 -0.333626 -0.062568 0.116100 0.054254 0.102726 0.385304 0.275070 0.151775 0.068550 -0.266495 -0.168449 0.324014 -0.107966 -0.097693 0.169377 0.154314
polarizability: 3.10169743e+02 -4.21978372e+00 1.94479796e+02 -1.96336948e+01 -1.32674267e+01 1.07544204e+02
1716.lowfreq: -13.1905 -7.1991 -5.0541 -0.0004 -0.0002 0.0001 7.1858 21.8595 39.3470
frequency: 3.8975 21.7599 39.3112 43.9626 61.2717 73.1808 81.7260 90.2396 126.8792 130.7847 155.8952 171.1351 202.7766 210.8934 215.9184 227.8971 242.2671 257.9369 274.9780 287.3256 298.3798 324.6236 373.3383 381.5238 414.4151 427.2863 463.6460 466.8653 493.7353 538.7459 564.0740 567.4949 593.1345 636.8080 677.8038 683.7976 707.7296 732.6530 752.9397 761.5804 800.2559 815.0183 874.7017 884.3060 895.4013 917.8124 938.5677 940.0808 952.3491 955.7767 979.3368 1010.7061 1028.9180 1045.5026 1075.5040 1095.5513 1111.2054 1112.5513 1113.5134 1144.4851 1146.1457 1149.3651 1176.3738 1184.6875 1218.7562 1230.5478 1270.9190 1272.0889 1279.7064 1290.1668 1301.2570 1328.3871 1336.8580 1349.8206 1369.8021 1377.0597 1423.0287 1431.8058 1435.4320 1440.0501 1446.5556 1458.8257 1464.8929 1468.2432 1469.3619 1472.9851 1478.1232 1497.8434 1562.8929 1568.6173 1618.1387 1648.2034 2957.0941 2959.4342 2980.0200 3004.9608 3011.2340 3046.1399 3047.1535 3088.9840 3095.5132 3107.3676 3121.1915 3126.0373 3126.6228 3150.2983 3158.6122 3171.7403 3182.9371 3554.6211 3569.2950
redmass: 5.4842 5.7020 3.4266 5.5504 4.1179 3.8975 4.3887 3.3177 4.3207 6.4642 1.0846 2.5385 4.5781 1.8747 3.6027 3.8359 3.1190 1.7224 3.4736 1.7566 2.6728 2.7521 5.8199 2.8203 4.2437 4.4160 4.3426 4.3160 3.6521 1.2691 4.4988 4.6636 2.8432 3.4513 5.5217 3.5043 3.4845 1.1998 3.5405 3.6639 4.1744 1.5723 1.7742 1.8197 3.0229 3.7107 1.4766 3.4125 4.5042 5.8843 2.1067 3.3063 1.1832 2.4761 2.3606 2.3411 1.2474 1.2715 2.2766 1.5066 1.7191 1.3910 1.7297 1.7483 1.5880 3.1626 1.4034 1.1378 1.3049 1.7208 1.2459 1.5934 1.4531 1.2181 1.3334 5.9801 1.8921 1.2091 1.5707 1.2689 1.2079 1.0636 1.0955 1.0589 1.1663 1.1150 1.7694 2.0547 5.0094 5.6054 6.8175 5.7236 1.0318 1.0331 1.0835 1.0634 1.0645 1.1043 1.1040 1.1008 1.1021 1.0932 1.0999 1.0875 1.0992 1.0878 1.0912 1.0963 1.0692 1.0781 1.0663
irintensity: 1.7835 1.7295 4.3566 1.3883 0.2965 1.3415 2.7648 14.8248 2.7917 0.5695 0.0565 4.5649 2.8614 1.4452 6.6646 7.0739 7.6371 4.0008 5.1519 94.4000 20.6733 45.4922 1.6232 32.2529 6.4956 3.8823 10.7052 12.7947 11.8938 108.8929 18.8127 11.8639 18.3283 5.1038 23.7879 5.1296 2.3140 108.7425 8.5453 17.0738 2.2563 33.0640 51.9615 2.7925 7.6259 12.2667 0.9652 88.8152 11.3672 55.8563 4.7220 60.1899 36.5404 7.8346 76.8034 10.2735 0.6238 0.6032 21.1700 9.9735 15.1097 4.5404 83.2056 124.4237 58.0930 132.0634 81.5460 72.0126 14.0543 31.5067 3.8871 22.5440 6.1555 24.1306 5.5165 38.1229 84.8158 42.2078 5.1886 8.6572 147.7122 14.7666 40.5683 17.9672 71.6240 42.1541 57.0997 299.0729 172.6864 30.8836 17.2278 126.4534 63.3720 72.1427 82.4662 53.0998 46.4931 47.1092 48.4681 16.7840 52.0320 13.0153 27.5357 3.9064 22.9639 7.3967 3.0492 15.1209 583.2945 38.5591 4.0912
temp: 298.150 k
press: 1.00000 atm
elementType: 8 8 8 8 8 7 6 6 6 6 6 6 6 6 6 6 6 6 6 6 1 1 1 1 1 1 1 1 1 1 1 1 1 1 1 1 1 1 1
symmnumber: 1
zpe: 820030.3 jmol-1
zpe.correction: 0.312333 hartree
zpe.thermalcorrener: 0.333861 hartree
zpe.thermalcorrenthalpy: 0.334806 hartree
zpe.thermalcorrgfe: 0.257918 hartree
zpe.sumelectzpe: -974.189947 hartree
zpe.sumelectthermal: -974.168419 hartree
zpe.sumelectthermalent: -974.167475 hartree
zpe.sumelectthermalfe: -974.244362 hartree
dipole: 4.3500 -3.4583 3.1625
dipole: 6.3940
quadrupole: -86.9637 -117.1305 -120.8934
quadrupole: 13.2473 -6.1731 2.5731
quadrupole: 21.3655 -8.8013 -12.5642 13.2473 -6.1731 2.5731
hfenergy: -974.5022804 hartree
pointgroup: C01 [X(C14H19N1O5)]
dipole: 1.6285236 -1.224561 1.4753131 debye
polarizability: 308.3595368|-16.6705841|188.3322261|-20.6720621|-26.8906943|115.5019805 unknown
InChI: InChI=1S/C14H19NO5/c1-19-12-4-5-13(20-2)10(7-12)3-6-14(18)15-8-11(17)9-16/h3-7,11,15-17H,8-9H2,1-2H3
charge 0 multiplicity 1
39 atoms
O  -4.978929 1.498596 -0.629497
O  -5.211092 -2.245243 -0.171478
O  2.335425 2.306211 -1.055837
O  3.879284 -2.788467 0.80706
O  -2.342849 1.555509 0.034456
N  -3.017575 -0.315244 1.239565
C  -5.229328 0.246864 0.076674
C  -4.416363 0.130318 1.397439
C  -4.981056 -0.955749 -0.860549
C  1.764332 0.136496 -0.015613
C  -2.04903 0.444167 0.611842
C  2.735633 1.044281 -0.550991
C  0.355068 0.544848 0.027071
C  2.213486 -1.135399 0.424416
C  -0.67072 -0.101991 0.65833
C  3.574271 -1.500277 0.338446
C  4.090498 0.673959 -0.642523
C  4.524836 -0.595665 -0.203368
C  2.260751 3.381414 -0.045694
C  5.275326 -3.224615 0.728612
H  -6.302373 0.280488 0.357541
H  -4.905011 -0.597636 2.065947
H  -4.428289 1.124269 1.883953
H  -3.925424 -0.985047 -1.174608
H  -5.613829 -0.852523 -1.763231
H  -2.78318 -1.260368 1.547561
H  0.100097 1.468257 -0.510429
H  1.510742 -1.876296 0.81765
H  -0.507632 -1.025951 1.229133
H  4.79934 1.385861 -1.077411
H  -3.996677 1.713889 -0.519327
H  5.58068 -0.866313 -0.293299
H  -6.185452 -2.372756 -0.051012
H  1.940438 4.280711 -0.592943
H  1.521092 3.138571 0.742001
H  3.251762 3.552005 0.418682
H  5.280806 -4.243191 1.143121
H  5.936175 -2.572997 1.333111
H  5.632672 -3.247384 -0.319403
