program: Gaussian 09
title: 000292419
version: EM64L-G09RevD.01
frameworkgroup: C1[X(C15H17NO)]
method: RPBEPBE
basis: SDD
operation: Freq
keyword: #p
keyword: freq=noraman
keyword: PBEPBE/SDD
title: #p freq=noraman PBEPBE/SDD
converged: YES YES NO NO
title: Mulliken charges:
elementType: O N C C C C C C C C C C C C C C C H H H H H H H H H H H H H H H H H
charge: -0.446201 -0.434235 0.287750 -0.463966 0.317910 0.289762 0.464684 -0.544473 -0.359231 -0.456409 -0.848984 0.121651 -0.384991 -0.819577 -0.391471 -0.250495 -0.209263 0.261873 0.226763 0.305845 0.225055 0.234361 0.222239 0.230029 0.217942 0.235973 0.267021 0.222362 0.220260 0.223859 0.217704 0.228721 0.228687 0.358845
chargesum: 0.00000
title: Mulliken charges with hydrogens summed into heavy atoms:
elementType: O N C C C C C C C C C C C C C C C
charge: -0.087356 -0.128390 0.287750 0.024670 0.317910 0.289762 0.464684 -0.319418 -0.124869 -0.234170 -0.165040 0.121651 -0.117971 -0.153096 -0.173767 -0.021775 0.019424
polarizability: 2.60204873e+02 -9.34611162e+00 1.71653292e+02 -7.72083753e+00 -2.81319286e+00 9.75690798e+01
1716.lowfreq: -5.5151 -4.2866 -0.0009 -0.0007 -0.0007 8.7770 21.1903 26.7409 45.9752
frequency: 21.0953 26.7068 45.9182 56.1020 97.3885 149.3626 155.6997 182.3733 187.7709 209.9870 214.5153 268.0659 279.2795 344.6321 348.8764 364.3441 414.9772 430.8687 440.7137 457.6679 480.9932 508.3300 526.6559 544.1559 560.0673 570.6530 598.1607 708.4906 714.6680 724.2518 754.2993 757.1527 805.0948 819.4703 838.1865 848.1829 883.3790 926.8218 932.2590 939.0654 973.1389 977.5601 997.2742 1014.2587 1038.7059 1039.9432 1047.0625 1066.7549 1091.8908 1144.9100 1152.8431 1170.1586 1171.0774 1197.4506 1226.0884 1236.2112 1243.8027 1285.8598 1296.0613 1313.6762 1350.4455 1375.8472 1393.8816 1396.5751 1398.0704 1420.2865 1438.6136 1447.7665 1470.2672 1471.2807 1478.1194 1486.6881 1493.5814 1497.5733 1522.7383 1589.4422 1603.1937 1617.7001 1634.8505 2944.5292 2946.2871 2966.1191 2983.2953 3011.7069 3040.2934 3074.0179 3081.6328 3102.4176 3111.7776 3117.6899 3132.7680 3145.8755 3155.0456 3166.7123 3554.9693 3582.4322
redmass: 4.0685 4.1840 1.0500 4.2088 3.5760 3.3471 2.7351 2.7550 2.3815 2.0865 2.5702 3.1411 2.6594 4.1733 2.8444 1.1500 1.7854 2.7354 2.8900 2.4456 3.7169 3.9609 5.4156 3.9653 2.9644 4.3305 5.5427 4.3463 3.1863 3.1693 4.3966 1.4763 1.4595 4.8893 2.8480 1.5551 1.2971 3.1880 1.3743 1.3443 1.5140 1.3458 1.7727 1.4953 2.0813 1.5045 1.5282 2.7546 2.9784 1.6782 1.3793 1.0720 1.5236 1.6202 1.3665 1.9001 2.5768 1.7144 1.5257 2.0782 1.8193 3.1009 1.3070 1.8928 2.1464 2.9686 2.3396 1.6115 1.0482 1.0572 1.0922 1.3983 1.2252 1.6913 2.9620 5.0636 6.4886 6.7456 6.5285 1.0416 1.0563 1.0372 1.1021 1.0957 1.0977 1.0980 1.0953 1.0909 1.0887 1.0887 1.0871 1.0932 1.0939 1.1004 1.0760 1.0660
irintensity: 0.3123 0.2733 0.2146 0.5707 1.0280 0.6140 1.7318 1.2097 4.0420 0.9079 1.1935 10.0288 0.3668 4.6068 24.8655 122.6204 125.5948 22.9319 5.6350 20.4491 18.0367 2.1396 1.6826 0.9011 3.9662 1.4506 2.4006 5.0458 6.8389 0.8190 7.9934 80.3224 47.7009 24.4202 4.4956 0.6752 6.3924 2.9974 0.2205 3.2723 14.6463 0.6632 6.3527 5.2510 7.1778 0.6519 15.0028 73.6472 38.6912 40.0886 40.5863 2.9697 3.0148 23.3397 10.5964 6.1412 34.4709 46.7184 8.6390 55.3175 21.2333 26.1306 12.9501 12.4559 5.6353 4.3896 36.7245 30.7559 19.8906 4.8185 7.7444 85.9646 12.4344 17.3431 310.1707 3.6725 25.7699 1.8198 69.7035 54.3410 20.7520 70.7041 18.0670 28.0671 28.5852 20.6973 19.2175 32.7654 14.8475 27.8041 1.9612 21.1388 21.5951 23.3913 19.6840 28.9584
temp: 298.150 k
press: 1.00000 atm
elementType: 8 7 6 6 6 6 6 6 6 6 6 6 6 6 6 6 6 1 1 1 1 1 1 1 1 1 1 1 1 1 1 1 1 1
symmnumber: 1
zpe: 735858.3 jmol-1
zpe.correction: 0.280274 hartree
zpe.thermalcorrener: 0.296859 hartree
zpe.thermalcorrenthalpy: 0.297803 hartree
zpe.thermalcorrgfe: 0.234561 hartree
zpe.sumelectzpe: -710.542732 hartree
zpe.sumelectthermal: -710.526147 hartree
zpe.sumelectthermalent: -710.525203 hartree
zpe.sumelectthermalfe: -710.588445 hartree
dipole: -3.2957 0.2629 0.9041
dipole: 3.4276
quadrupole: -83.2471 -92.3856 -104.7114
quadrupole: 5.9478 -3.7323 -0.6830
quadrupole: 10.2009 1.0624 -11.2634 5.9478 -3.7323 -0.6830
hfenergy: -710.8230061 hartree
pointgroup: C01 [X(C15H17N1O1)]
dipole: 1.2894238 0.1864807 -0.347977 debye
polarizability: 260.2492958|9.8476521|160.3632222|-9.2107168|25.9862799|108.8147273 unknown
InChI: InChI=1S/C15H17NO/c1-11-7-8-14(12(2)9-11)16-10-13-5-3-4-6-15(13)17/h3-9,16-17H,10H2,1-2H3
charge 0 multiplicity 1
34 atoms
O  3.006678 -1.892147 -1.70086
N  -0.117725 0.28811 -0.078311
C  -1.504403 0.073904 -0.021949
C  0.84985 -0.803782 -0.236047
C  -2.386861 1.205146 0.054833
C  2.277097 -0.315539 -0.028465
C  -4.348058 -0.31814 0.162521
C  -3.775896 0.982538 0.141095
C  -2.065213 -1.233209 -0.013614
C  -3.462191 -1.416984 0.083781
C  -1.819134 2.613021 0.052623
C  3.344202 -0.882639 -0.775105
C  2.59529 0.68474 0.921646
C  -5.852274 -0.509669 0.265559
C  4.679973 -0.455936 -0.589463
C  3.925393 1.120684 1.120638
C  4.969352 0.548758 0.359577
H  0.770357 -1.297841 -1.226681
H  0.623423 -1.585226 0.519236
H  0.202038 1.213407 -0.365691
H  -4.439601 1.856208 0.1999
H  -1.418833 -2.11237 -0.095716
H  -3.865221 -2.437525 0.089348
H  -1.119105 2.772667 0.897659
H  -1.261916 2.839873 -0.880858
H  -2.623312 3.362864 0.1384
H  1.780134 1.113096 1.515377
H  -6.387179 0.007818 -0.5539
H  -6.123787 -1.578958 0.217541
H  -6.251165 -0.107648 1.217198
H  5.489128 -0.905819 -1.180059
H  4.144446 1.894409 1.863722
H  6.004445 0.877313 0.502375
H  3.80817 -2.199025 -2.192713
