program: Gaussian 09
title: 000292404
version: EM64L-G09RevD.01
frameworkgroup: C1[X(C4H5BrF3NO)]
method: RPBEPBE
basis: SDD
operation: Freq
keyword: #p
keyword: freq=noraman
keyword: PBEPBE/SDD
title: #p freq=noraman PBEPBE/SDD
converged: YES YES NO NO
title: Mulliken charges:
elementType: Br F F F O N C C C C H H H H H
charge: -0.009495 -0.139394 -0.177076 -0.140304 -0.212519 -0.348928 -0.333329 -0.639409 0.176796 0.329973 0.275378 0.267272 0.361140 0.291919 0.297976
chargesum: 0.00000
title: Mulliken charges with hydrogens summed into heavy atoms:
elementType: Br F F F O N C C C C
charge: -0.009495 -0.139394 -0.177076 -0.140304 -0.212519 0.012212 0.209322 -0.049514 0.176796 0.329973
polarizability: 8.50685693e+01 1.41702633e+01 7.34246385e+01 4.66446592e+00 4.92067547e+00 4.66511077e+01
1716.lowfreq: -7.5295 -0.0005 -0.0005 0.0004 1.9067 2.9556 13.5890 30.4101 47.0864
frequency: 12.5392 30.3294 47.0656 102.5394 159.7931 218.0753 256.6308 302.2260 344.8601 376.4523 428.5517 458.5839 512.1224 542.1587 635.5359 666.3210 709.7976 774.8165 842.0771 972.1581 983.1651 1019.0819 1039.5585 1071.0762 1136.3479 1168.8535 1219.6649 1253.5164 1289.8865 1363.7897 1437.0712 1450.7494 1501.8520 1655.5663 3005.0517 3060.9615 3071.0503 3155.7154 3523.5969
redmass: 13.0477 7.9652 15.8518 3.4489 11.6645 4.8539 11.1344 5.5902 3.2849 14.1654 6.1447 5.2556 9.5338 3.7295 12.7867 1.1902 8.9819 2.8834 2.4194 2.5822 1.7112 7.7316 12.4240 3.4112 2.7802 1.7141 1.2792 2.1091 1.2086 1.3207 1.1037 1.0814 1.8533 10.1349 1.0590 1.0792 1.0808 1.1116 1.0779
irintensity: 1.5056 7.3466 1.6450 1.3320 2.1574 8.1449 5.9762 1.9088 21.5738 4.0662 4.2120 5.6877 1.7313 14.6884 12.3854 144.3468 3.1243 19.3191 40.4192 7.4545 26.5242 197.2993 253.5512 33.2200 129.1599 38.7139 42.2752 34.7819 21.9651 6.4744 9.1193 34.7329 137.6313 255.9086 20.7477 6.3222 11.4411 5.1339 59.2637
temp: 298.150 k
press: 1.00000 atm
elementType: 35 9 9 9 8 7 6 6 6 6 1 1 1 1 1
symmnumber: 1
zpe: 250014.7 jmol-1
zpe.correction: 0.095226 hartree
zpe.thermalcorrener: 0.105939 hartree
zpe.thermalcorrenthalpy: 0.106883 hartree
zpe.thermalcorrgfe: 0.054462 hartree
zpe.sumelectzpe: -597.611488 hartree
zpe.sumelectthermal: -597.600775 hartree
zpe.sumelectthermalent: -597.599831 hartree
zpe.sumelectthermalfe: -597.652252 hartree
dipole: -3.4865 0.9619 -0.9372
dipole: 3.7362
quadrupole: -80.4141 -67.7056 -65.7882
quadrupole: -7.7445 -1.3317 -0.4227
quadrupole: -9.1115 3.5971 5.5144 -7.7445 -1.3317 -0.4227
hfenergy: -597.7067137 hartree
pointgroup: C01 [X(C4H5Br1F3N1O1)]
dipole: 1.4558338 -0.0379075 0.1994852 debye
dipolederiv: -0.2225457 0.0738666 0.0762712 0.160141 -0.3886178 -0.1435847 0.0833641 -0.0563287 -0.2004495 -0.6287953 -0.0163394 0.2881696 -0.0638888 -0.273192 0.0050633 0.2317958 -0.0333681 -0.5942392 -0.4651341 0.0340999 -0.0009797 0.05373 -0.8289704 -0.0656637 -0.0082059 -0.0773923 -0.3019162 -0.5199337 0.0482816 -0.2352096 -0.0036867 -0.3148406 0.1033951 -0.2252131 0.1438724 -0.6442798 -0.6419656 0.0247909 0.0033224 0.4136525 -0.8830814 -0.0889861 0.0365256 -0.091237 -0.3255138 -1.1281633 0.3294922 0.1007502 0.1663355 -0.4900635 -0.0028263 0.0506605 0.0115666 -0.487435 0.466363 0.0391761 0.0344228 0.4346441 -0.1198306 -0.1318197 0.0891618 -0.0584807 0.2229164 0.1514165 -0.2115813 -0.0949211 -0.3429715 0.6776587 0.1890825 -0.1193816 0.1993337 0.1366445 1.1633271 -0.377236 -0.0081896 -0.6722835 1.082529 0.1417943 -0.0057663 0.1179139 0.1259363 1.5051156 -0.1326728 -0.0724107 -0.0426247 1.2966184 -0.0712564 -0.0241377 -0.0598759 1.5711555 0.1037308 0.0955565 0.0555307 -0.0825685 0.0461295 -0.0021124 0.0412628 -0.0487226 0.0953742 -0.0450877 0.009308 -0.0551205 -0.032319 0.1075658 0.1158626 -0.0730466 0.0512675 -0.0226506 0.2648299 0.0179851 -0.0402274 -0.0417846 0.211913 -0.0254305 -0.0835279 -0.023162 0.352823 -0.0622981 -0.0145321 0.0079468 -0.0375367 -0.0670297 -0.048109 0.0098862 -0.0699069 0.0896536 0.0591405 0.0798048 -0.0593551 0.0911609 -0.0567886 0.0245908 -0.0033779 -0.0054799 -0.0180194 unknown
polarizability: 78.176566|-14.5477098|78.6710313|-6.2774291|9.0092896|48.2967183 unknown
InChI: InChI=1S/C4H5BrF3NO/c5-1-2-9-3(10)4(6,7)8/h9H,1-2H2
charge 0 multiplicity 1
15 atoms
Br 3.471249 -1.329041 -0.926044
F  -2.652318 -0.234806 1.218146
F  -1.379752 -1.655734 -0.017332
F  -2.406539 0.113478 -1.007835
O  -0.65819 1.858572 0.615629
N  0.690981 -0.05803 0.449519
C  1.965989 0.634787 0.680481
C  2.9007 0.583603 -0.530161
C  -0.500407 0.623093 0.433478
C  -1.734644 -0.284051 0.158651
H  1.722772 1.69214 0.898356
H  2.467105 0.205712 1.567029
H  0.707703 -1.066414 0.269238
H  3.838635 1.125283 -0.338116
H  2.419014 0.938309 -1.452838
