program: Gaussian 09
title: 000292415
version: EM64L-G09RevD.01
frameworkgroup: C1[X(C15H15N3O2)]
method: RPBEPBE
basis: SDD
operation: Freq
keyword: #p
keyword: freq=noraman
keyword: PBEPBE/SDD
title: #p freq=noraman PBEPBE/SDD
converged: YES YES NO NO
title: Mulliken charges:
elementType: O O N N N C C C C C C C C C C C C C C C H H H H H H H H H H H H H H H
charge: -0.211016 -0.212949 -0.148317 -0.096780 0.018688 0.411298 0.464656 -0.359030 -0.334904 -0.392712 -0.401835 -0.645185 -0.645866 -0.386528 0.295572 -0.486628 0.388238 -0.378559 -0.386681 -0.166698 0.240476 0.239989 0.226324 0.270353 0.239412 0.220668 0.239868 0.220303 0.239980 0.240520 0.219094 0.297431 0.259383 0.284888 0.236548
chargesum: 0.00000
title: Mulliken charges with hydrogens summed into heavy atoms:
elementType: O O N N N C C C C C C C C C C C C C C C
charge: -0.211016 -0.212949 -0.148317 -0.096780 0.018688 0.411298 0.464656 -0.118554 -0.094915 -0.166388 -0.131482 0.054763 0.054937 -0.167434 0.295572 -0.189197 0.388238 -0.119176 -0.101794 0.069851
polarizability: 4.74290081e+02 2.16622348e+01 1.93295950e+02 -9.15250541e+00 4.43141915e+00 9.75722963e+01
1716.lowfreq: -4.6992 -4.1303 -0.0009 -0.0003 0.0003 2.3547 26.1614 32.1049 39.7933
frequency: 26.1497 32.0747 39.7840 58.1792 75.1932 87.2774 118.1613 123.9896 161.5036 167.6973 195.0875 208.2050 231.9803 253.7096 260.7981 319.4539 372.1257 378.7200 396.4906 428.8259 431.3803 447.4643 476.8170 509.5850 521.4602 541.5235 551.1242 605.5279 631.4336 659.9691 681.5160 704.8728 722.6297 742.3263 764.8683 808.7494 812.3043 830.9445 847.1159 903.2637 913.0627 934.6606 939.6216 946.4332 978.6353 984.0230 991.6657 992.7921 994.2771 1055.2013 1076.4003 1080.9357 1105.4641 1111.7183 1129.0200 1164.3082 1165.3075 1178.8249 1198.9664 1216.3681 1255.9053 1263.4592 1282.3222 1318.9671 1359.6958 1368.0444 1370.4592 1376.2194 1394.4429 1430.1660 1437.8668 1451.7635 1458.6706 1465.2608 1471.2791 1477.6148 1492.0115 1505.6026 1533.9927 1548.5215 1565.3162 1584.7883 1617.0422 1635.2895 2938.7323 2949.0514 2956.0640 3018.1311 3021.3768 3101.5995 3111.8009 3118.2679 3146.8013 3147.1443 3167.0809 3168.8739 3170.9288 3171.6003 3190.7996
redmass: 4.4630 4.5438 6.7136 8.2627 2.2991 5.0494 2.2887 2.4933 2.4528 5.1490 1.1859 4.7525 5.4962 2.8368 3.3271 4.3055 9.0888 3.6602 3.8266 3.0505 3.3921 6.2622 4.1973 3.6437 3.2091 4.3986 4.2006 5.8473 7.1565 8.0455 2.2227 5.5709 5.3982 3.4542 9.9983 1.3213 1.4501 1.6589 4.4661 3.1804 1.9963 1.4019 3.0481 1.3811 2.1137 2.1129 1.5955 1.4192 2.8557 1.5093 1.7334 1.6487 1.2363 1.3285 1.4874 1.5018 1.3048 2.1130 1.4735 7.1773 2.8825 1.6879 1.3237 1.5357 2.1133 6.4829 3.8544 7.1964 2.5964 1.2276 3.7433 2.6001 1.3378 1.0405 2.6375 1.0459 1.1139 1.1356 2.8529 6.9146 6.2462 6.2082 6.8323 6.4154 1.0860 1.0367 1.0391 1.0998 1.1027 1.0967 1.0947 1.0896 1.0877 1.0876 1.0936 1.0944 1.0953 1.0920 1.0961
irintensity: 0.1693 1.5318 0.4517 0.7024 0.3379 0.5730 3.8695 2.3855 4.8543 1.3446 0.0160 0.6942 4.8533 2.6756 1.9917 4.4876 0.8048 8.5594 0.8520 1.2674 0.3277 3.6466 5.1157 16.2143 9.9412 6.1549 14.2123 0.3473 0.1272 12.7039 23.2065 21.3956 3.0122 2.8662 43.1802 7.2915 38.1889 68.0665 4.9462 29.1049 30.4547 3.4587 30.9559 3.8507 17.6910 0.3073 17.2324 2.1765 0.4156 25.3757 9.9319 21.7438 0.0293 0.9560 16.2741 17.3385 11.0241 255.7559 81.9171 347.3061 24.8684 11.8370 1.6001 12.2869 59.5461 32.8034 264.8314 94.1551 6.4646 14.8272 28.2195 47.1618 2.3559 0.0576 132.2796 24.0663 8.5179 56.0209 475.5001 167.6579 4.2620 890.0349 44.6918 246.8663 46.7158 92.2776 153.8386 7.8929 68.8671 4.0038 46.6240 8.7129 14.8778 1.9917 20.2550 8.6411 16.9445 6.6181 4.9867
temp: 298.150 k
press: 1.00000 atm
elementType: 8 8 7 7 7 6 6 6 6 6 6 6 6 6 6 6 6 6 6 6 1 1 1 1 1 1 1 1 1 1 1 1 1 1 1
symmnumber: 1
zpe: 713757.4 jmol-1
zpe.correction: 0.271856 hartree
zpe.thermalcorrener: 0.290211 hartree
zpe.thermalcorrenthalpy: 0.291155 hartree
zpe.thermalcorrgfe: 0.223301 hartree
zpe.sumelectzpe: -893.774323 hartree
zpe.sumelectthermal: -893.755968 hartree
zpe.sumelectthermalent: -893.755024 hartree
zpe.sumelectthermalfe: -893.822878 hartree
dipole: -9.6462 2.4586 -1.0548
dipole: 10.0103
quadrupole: -97.5834 -114.9079 -119.2635
quadrupole: 22.6452 -7.4695 4.9909
quadrupole: 13.0016 -4.3230 -8.6786 22.6452 -7.4695 4.9909
hfenergy: -894.0461787 hartree
pointgroup: C01 [X(C15H15N3O2)]
dipole: 3.8055225 -1.009644 0.0965445 debye
polarizability: 473.4526421|27.8618072|176.0408411|9.8143527|-36.8017176|115.6648437 unknown
InChI: InChI=1S/C15H15N3O2/c1-17(2)14-8-6-12(7-9-14)11-16-13-4-3-5-15(10-13)18(19)20/h3-11H,1-2H3
charge 0 multiplicity 1
35 atoms
O  -6.267833 1.276917 -0.500093
O  -4.338628 2.484145 -0.616293
N  5.813053 0.316252 0.138387
N  -0.616923 -0.928598 0.260455
N  -4.981044 1.375843 -0.447212
C  4.433167 0.201766 -0.01157
C  1.581206 -0.041944 -0.314717
C  3.732584 0.93003 -1.030343
C  3.661712 -0.652337 0.851364
C  2.343629 0.80353 -1.170143
C  2.276676 -0.765957 0.69859
C  6.582461 1.198229 -0.751667
C  6.509014 -0.435535 1.193718
C  0.137302 -0.146475 -0.485695
C  -2.024248 -0.928537 0.136067
C  -2.789598 0.243235 -0.125098
C  -4.194007 0.142726 -0.181883
C  -2.711995 -2.158979 0.355551
C  -4.884215 -1.074114 0.009581
C  -4.1174 -2.228976 0.279671
H  4.275788 1.591947 -1.709811
H  4.155551 -1.225628 1.64075
H  1.83173 1.372176 -1.957371
H  1.693402 -1.417536 1.357664
H  6.4898 0.89083 -1.812427
H  7.647864 1.155228 -0.477925
H  6.251246 2.252854 -0.669187
H  7.58583 -0.210157 1.153221
H  6.384724 -1.529524 1.067742
H  6.141103 -0.161435 2.202524
H  -0.295195 0.464327 -1.308449
H  -2.319042 1.22282 -0.24904
H  -2.112174 -3.045841 0.582408
H  -5.975322 -1.093643 -0.040745
H  -4.622218 -3.186939 0.441475
