program: Gaussian 09
title: 000292414
version: EM64L-G09RevD.01
frameworkgroup: C1[X(C15H15ClN2)]
method: RPBEPBE
basis: SDD
operation: Freq
keyword: #p
keyword: freq=noraman
keyword: PBEPBE/SDD
title: #p freq=noraman PBEPBE/SDD
converged: NO YES NO NO
title: Mulliken charges:
elementType: Cl N N C C C C C C C C C C C C C C C H H H H H H H H H H H H H H H
charge: -0.070845 -0.149457 -0.090828 0.410360 0.465406 -0.360710 -0.336721 -0.397147 -0.403902 -0.645733 -0.646220 -0.397787 0.262460 -0.337957 -0.364152 -0.204896 -0.192812 -0.116164 0.238078 0.238439 0.222635 0.270670 0.237789 0.219293 0.237772 0.218652 0.239022 0.238929 0.213300 0.244632 0.255208 0.250111 0.252572
chargesum: 0.00000
title: Mulliken charges with hydrogens summed into heavy atoms:
elementType: Cl N N C C C C C C C C C C C C C C C
charge: -0.070845 -0.149457 -0.090828 0.410360 0.465406 -0.122633 -0.098282 -0.174512 -0.133232 0.049121 0.050384 -0.184486 0.262460 -0.093325 -0.108943 0.045215 0.059760 -0.116164
polarizability: 4.84002741e+02 -2.61828064e+00 1.62017062e+02 2.16831180e+00 -4.93538857e+00 9.13494492e+01
1716.lowfreq: -8.6109 -2.1747 -0.0018 0.0003 0.0004 3.7912 27.2669 34.1820 41.4960
frequency: 27.2566 34.1253 41.4594 73.4875 78.5971 109.3495 119.1588 158.1295 173.8174 194.7009 205.4349 251.7642 253.7786 300.0291 335.6412 357.2680 388.9638 413.8320 427.9812 436.1851 456.5339 488.5793 517.1956 533.6566 542.9136 623.1597 631.4781 650.2614 705.5976 723.4444 741.1563 805.8270 811.0667 814.6666 825.2671 831.6195 862.8685 938.0114 940.3459 941.7244 958.0957 977.1173 988.2608 991.8267 994.8008 1056.5519 1068.5801 1102.8394 1106.0046 1111.0924 1126.2821 1161.4120 1166.4376 1181.8161 1198.9867 1257.1546 1263.1577 1285.6836 1316.2130 1347.0440 1361.8236 1369.0973 1393.0626 1401.1794 1430.3302 1449.1282 1459.6785 1464.9244 1469.2071 1476.9895 1491.4987 1505.2101 1532.7597 1549.6219 1565.0656 1578.4131 1607.5626 1634.1058 2931.5749 2945.8381 2953.2489 3013.2429 3017.1956 3100.1392 3109.6358 3113.8415 3136.9217 3145.8573 3153.7347 3163.6787 3164.6833 3168.8345 3174.8553
redmass: 6.4391 4.1533 4.7191 3.6976 2.9091 2.2878 2.5274 3.5162 3.6263 1.2508 4.2358 5.0278 2.4247 4.7835 4.2850 6.0744 4.2790 2.9922 3.0237 4.3331 4.3612 3.6111 3.0594 2.5652 3.7669 7.1477 7.1444 6.6893 3.5511 4.6497 3.3552 1.3429 1.3944 5.4685 1.5477 1.7051 3.9057 1.3529 2.4622 1.5152 1.3525 1.5019 1.5941 2.9555 2.8999 1.5032 2.7249 1.3202 1.2393 1.3235 1.4956 1.7416 1.5528 1.3865 1.4201 2.8509 1.7455 1.2681 1.5872 3.0318 2.6201 4.1568 2.7003 3.8010 1.2642 2.6539 1.2875 1.0429 2.3387 1.0457 1.1062 1.1349 2.7675 7.0844 7.3784 6.2175 6.2408 6.4073 1.0854 1.0368 1.0392 1.1000 1.1025 1.0963 1.0944 1.0894 1.0882 1.0874 1.0882 1.0933 1.0961 1.0956 1.0975
irintensity: 0.6525 0.2356 0.1916 0.2757 1.1063 3.3714 1.2698 1.1312 4.6762 0.0437 2.4343 2.8908 1.0431 1.7698 14.4377 13.1260 1.8100 1.6186 0.7910 12.4148 4.0257 8.5656 4.6135 32.0923 9.3018 0.0738 2.4701 21.7795 2.9366 23.0397 4.1184 10.6432 15.2057 1.0592 14.8441 99.5464 19.6225 0.6915 34.1178 1.4917 0.4861 11.6933 5.7499 48.2675 0.6036 26.1872 63.1336 13.2164 0.0276 0.9891 18.1145 111.2879 5.5589 135.3725 21.8783 25.2109 12.4078 2.3987 18.2674 0.6228 105.2783 213.9214 6.5597 7.4362 14.8898 37.9781 3.1045 0.1887 176.9689 23.0335 5.4542 47.2823 412.0714 143.2866 0.1761 330.1414 268.8790 286.8135 56.9443 100.3957 157.7885 14.5884 66.8987 4.1562 50.2638 9.9521 8.5743 3.1545 4.3675 23.0877 8.7150 17.5639 5.1980
temp: 298.150 k
press: 1.00000 atm
elementType: 17 7 7 6 6 6 6 6 6 6 6 6 6 6 6 6 6 6 1 1 1 1 1 1 1 1 1 1 1 1 1 1 1
symmnumber: 1
zpe: 684614.6 jmol-1
zpe.correction: 0.260756 hartree
zpe.thermalcorrener: 0.277801 hartree
zpe.thermalcorrenthalpy: 0.278745 hartree
zpe.thermalcorrgfe: 0.214084 hartree
zpe.sumelectzpe: -1148.860006 hartree
zpe.sumelectthermal: -1148.842962 hartree
zpe.sumelectthermalent: -1148.842017 hartree
zpe.sumelectthermalfe: -1148.906679 hartree
dipole: 8.0361 -0.8819 -0.0638
dipole: 8.0846
quadrupole: -91.7813 -101.7618 -117.5679
quadrupole: 0.7551 1.2662 -1.1949
quadrupole: 11.9224 1.9418 -13.8642 0.7551 1.2662 -1.1949
hfenergy: -1149.1207623 hartree
pointgroup: C01 [X(C15H15Cl1N2)]
dipole: 3.1582113 0.328952 -0.1857702 debye
polarizability: 483.8771965|7.563369|123.9584965|1.116037|-35.5389972|129.5335597 unknown
InChI: InChI=1S/C15H15ClN2/c1-18(2)15-9-3-12(4-10-15)11-17-14-7-5-13(16)6-8-14/h3-11H,1-2H3
charge 0 multiplicity 1
33 atoms
Cl -7.230082 -0.048794 -0.242015
N  5.341179 -0.038418 0.078336
N  -1.1993 -0.375401 0.325184
C  3.953936 0.086847 0.008606
C  1.088573 0.338139 -0.130646
C  3.340363 1.210274 -0.638346
C  3.089082 -0.906922 0.584663
C  1.943533 1.323002 -0.700413
C  1.697861 -0.778408 0.513346
C  6.205248 0.991849 -0.514275
C  5.946788 -1.197035 0.750477
C  -0.362486 0.485689 -0.214647
C  -2.599088 -0.252051 0.14791
C  -3.20893 0.206409 -1.058532
C  -3.439853 -0.675366 1.216532
C  -4.61329 0.267485 -1.180285
C  -4.842715 -0.602821 1.110496
C  -5.411517 -0.127435 -0.089233
H  3.956228 1.99282 -1.089628
H  3.514312 -1.779691 1.088025
H  1.49963 2.194083 -1.200154
H  1.042588 -1.536901 0.954475
H  6.038887 1.089082 -1.606054
H  7.260526 0.720794 -0.355547
H  6.035061 1.985251 -0.052118
H  7.043807 -1.114734 0.703575
H  5.655534 -2.150967 0.266936
H  5.654896 -1.250918 1.81855
H  -0.721587 1.396132 -0.743861
H  -2.584937 0.481242 -1.916476
H  -2.968064 -1.052494 2.128974
H  -5.078733 0.606694 -2.110706
H  -5.48285 -0.917033 1.940052
