program: Gaussian 09
title: 000028079
version: EM64L-G09RevD.01
frameworkgroup: C1[X(C20H25N3O4)]
method: RPBEPBE
basis: SDD
operation: Freq
keyword: #p
keyword: freq=noraman
keyword: PBEPBE/SDD
title: #p freq=noraman PBEPBE/SDD
converged: YES YES NO NO
title: Mulliken charges:
elementType: O O O O N N N C C C C C C C C C C C C C C C C C C C C H H H H H H H H H H H H H H H H H H H H H H H H H
charge: -0.203333 -0.282520 -0.304966 -0.306835 -0.071120 -0.149484 -0.105634 -0.356370 -0.362767 -0.376242 -0.408601 -0.445697 0.245004 0.086781 0.387311 -0.325485 -0.514071 -0.537052 -0.180242 -0.347277 0.247429 0.269355 -0.222002 0.041415 -0.523633 -0.527774 -0.524157 0.183416 0.207659 0.252672 0.184774 0.223294 0.196790 0.219820 0.271203 0.213184 0.235841 0.213275 0.265712 0.302102 0.227167 0.230725 0.226193 0.259391 0.233119 0.217489 0.253480 0.223330 0.232771 0.237172 0.230584 0.256805
chargesum: 0.00000
title: Mulliken charges with hydrogens summed into heavy atoms:
elementType: O O O O N N N C C C C C C C C C C C C C C C C C C C C
charge: -0.203333 -0.282520 -0.304966 -0.306835 -0.071120 -0.149484 -0.105634 0.034705 0.074679 0.043841 0.082423 0.003329 0.245004 0.086781 0.387311 -0.112210 -0.248359 -0.234950 0.046925 -0.116551 0.247429 0.269355 0.004192 0.041415 0.186366 0.181807 0.200404
polarizability: 4.07709387e+02 -4.65982511e+00 2.37188642e+02 -1.02288462e+01 -1.02970660e+01 1.70531814e+02
1716.lowfreq: -4.3994 -0.0005 0.0007 0.0010 2.3246 9.4467 11.1475 21.0018 27.1604
frequency: 11.0892 20.7274 27.0932 42.6564 57.4823 63.4770 72.4207 78.1790 84.7856 93.7248 104.7197 125.8225 143.1795 146.9370 159.7406 164.3953 166.7449 182.8939 198.7257 211.5751 229.8608 245.3559 254.9330 281.5167 298.0368 308.1990 320.5059 336.6957 360.1307 381.2485 395.1813 410.0504 417.3512 459.9575 470.6560 489.8507 508.0122 515.5840 522.1284 542.6678 593.3560 608.5345 623.4584 634.7715 646.3733 673.7425 725.8492 729.7163 738.6755 766.5366 773.6040 786.4688 838.0750 844.0797 852.6990 864.9322 877.2223 918.4034 927.2386 937.0880 941.6475 945.4988 950.8820 955.4211 974.5537 993.2841 1008.3065 1030.3950 1041.6415 1045.4965 1052.2115 1055.9298 1090.4840 1098.8348 1111.6059 1112.1088 1114.3768 1124.2203 1139.8062 1149.7278 1154.1885 1158.8576 1166.9464 1170.4443 1183.6026 1196.5196 1204.5743 1216.7288 1237.0774 1254.6203 1274.7317 1295.7407 1300.7483 1303.8780 1330.4224 1332.4886 1341.6798 1360.0159 1361.8599 1364.3247 1382.3324 1392.7423 1393.7985 1416.4392 1425.8226 1435.2651 1436.7764 1438.3880 1454.1160 1454.2775 1457.2711 1458.5418 1460.4897 1461.7372 1464.3481 1469.5968 1476.6461 1483.6509 1485.8638 1489.3853 1550.5166 1556.3063 1589.0819 1598.8641 1609.8514 2807.0046 2844.5256 2860.8619 2953.3030 2967.7821 2974.9291 2978.2217 2983.4710 2998.0335 3021.4482 3073.8071 3082.8997 3084.9146 3085.7823 3091.2141 3102.6354 3116.4315 3124.4295 3127.2176 3129.8704 3132.5753 3162.9834 3166.8189 3172.0339 3175.3058
redmass: 5.5710 5.2714 3.9909 5.0631 3.4601 3.6030 3.4416 4.4136 2.8580 3.1137 4.0077 2.8738 4.0490 1.6559 1.5745 1.4461 1.2044 3.4895 3.8376 3.0206 4.2031 4.9172 1.9950 5.1406 2.2190 4.8146 4.4205 5.5968 5.4054 6.0902 2.1764 3.4264 6.0372 2.7397 3.8637 5.0671 2.7907 4.1380 5.1001 5.6972 5.0234 3.5681 3.5763 3.8720 3.7941 4.5060 1.6778 4.6502 4.8966 2.5612 3.9213 4.3767 1.5723 1.4128 5.6806 4.2279 1.9962 1.5694 4.1035 8.8662 1.4184 2.2141 4.9767 5.8454 1.3203 2.2097 2.8935 4.2188 2.6812 2.5170 1.7906 2.0750 1.7481 2.1543 1.3271 1.2371 1.2436 2.8189 2.9010 1.3766 1.4353 1.4777 2.5719 1.1443 2.1407 2.0190 1.1020 1.5309 1.4489 1.3476 1.6449 3.1306 1.8617 1.5523 1.7535 1.6893 1.8665 2.4283 1.4335 2.1138 1.5210 2.5893 2.0486 1.3467 2.1554 1.2497 1.2597 1.3163 1.1439 1.3100 1.1369 1.0535 1.0708 1.1251 1.3976 1.1960 1.0590 1.0541 1.0568 2.8926 5.1591 7.7138 7.3904 6.0685 8.4710 1.0699 1.0706 1.0700 1.0694 1.0690 1.0312 1.0334 1.0294 1.0837 1.0892 1.1037 1.0892 1.1010 1.1038 1.0913 1.0929 1.0893 1.1030 1.1036 1.1043 1.0884 1.0924 1.0913 1.0919 1.1001
irintensity: 0.1756 0.6979 0.5421 0.2605 0.3087 3.4472 2.9056 2.3590 2.9821 4.2065 4.3447 3.2176 3.3221 0.5710 1.7317 2.2667 1.1435 7.1097 1.4558 2.5514 2.8288 16.7638 2.5714 13.8739 12.2414 2.2774 2.9320 7.2209 12.8492 2.1793 0.7354 3.4342 3.2462 1.0030 5.5498 4.2625 8.3186 0.4588 0.7005 2.2280 0.3240 0.5823 0.7020 16.8002 4.1463 40.0687 34.3326 0.5878 4.7706 61.1050 11.6238 2.0223 0.6734 0.0550 10.6653 6.0361 22.1108 15.4411 4.6309 109.0507 1.2163 21.5142 15.3973 257.6899 0.0783 4.9878 50.9168 98.0768 44.8664 28.2097 2.0618 6.7936 3.2332 12.9975 46.3176 10.0504 3.0253 100.9025 71.4362 19.1287 24.5257 18.6727 17.9022 11.1779 7.9036 6.4610 6.6596 19.7545 60.7261 159.8389 92.2350 333.5382 14.6146 18.4310 15.5650 69.5663 17.1152 2.6303 25.3585 29.4692 6.6293 81.2072 11.6737 5.3625 31.8331 51.9630 18.8891 6.5245 65.7731 42.5447 11.3303 16.5639 1.2835 60.4218 2.7653 15.7873 4.2010 17.8534 33.8003 209.9424 46.3988 141.7390 39.9643 433.1350 40.0655 108.4330 60.7413 111.5211 54.1289 70.6842 64.6408 98.0975 59.1422 26.1495 60.3820 25.8883 8.6992 22.8543 26.1966 22.9485 10.2494 32.4707 20.8327 22.5870 15.7478 12.5729 35.3556 2.5667 5.1679 17.3767
temp: 298.150 k
press: 1.00000 atm
elementType: 8 8 8 8 7 7 7 6 6 6 6 6 6 6 6 6 6 6 6 6 6 6 6 6 6 6 6 1 1 1 1 1 1 1 1 1 1 1 1 1 1 1 1 1 1 1 1 1 1 1 1 1
symmnumber: 1
zpe: 1103385.2 jmol-1
zpe.correction: 0.420257 hartree
zpe.thermalcorrener: 0.447245 hartree
zpe.thermalcorrenthalpy: 0.448189 hartree
zpe.thermalcorrgfe: 0.360096 hartree
zpe.sumelectzpe: -1240.178733 hartree
zpe.sumelectthermal: -1240.151745 hartree
zpe.sumelectthermalent: -1240.150801 hartree
zpe.sumelectthermalfe: -1240.238895 hartree
dipole: 4.6125 5.2870 -0.9561
dipole: 7.0811
quadrupole: -127.3317 -159.3577 -156.2396
quadrupole: -2.4881 3.0444 -5.6650
quadrupole: 20.3113 -11.7147 -8.5966 -2.4881 3.0444 -5.6650
hfenergy: -1240.5989905 hartree
pointgroup: C01 [X(C20H25N3O4)]
dipole: -1.8802502 -2.0545721 0.068525 debye
polarizability: 407.2958063|-7.6367478|238.7590018|11.8837553|-4.9252925|169.375035 unknown
InChI: InChI=1S/C20H25N3O4/c1-25-17-12-15(13-18(26-2)20(17)27-3)16(24)14-22-8-10-23(11-9-22)19-6-4-5-7-21-19/h4-7,12-13H,8-11,14H2,1-3H3
charge 0 multiplicity 1
52 atoms
O  -0.447916 1.747808 -1.067471
O  -5.389616 2.470549 -0.450515
O  -4.609331 -2.207076 0.995788
O  -6.440698 -0.004662 0.599208
N  1.526804 -0.249307 -0.649843
N  4.396401 -0.136898 -0.411192
N  6.129573 0.917687 0.781107
C  2.337603 -1.489128 -0.657496
C  2.173717 0.796239 0.188727
C  3.75833 -1.20584 -1.19254
C  3.587667 1.098766 -0.331534
C  0.128499 -0.510947 -0.295119
C  5.702826 -0.184707 0.072218
C  -0.844283 0.643711 -0.598951
C  -2.301381 0.412786 -0.301919
C  6.575548 -1.305981 -0.136344
C  -2.798293 -0.823491 0.190171
C  -3.206033 1.476513 -0.547701
C  7.867904 -1.274099 0.414799
C  7.386557 0.919483 1.298058
C  -4.581529 1.336491 -0.275553
C  -4.171763 -0.976313 0.454571
C  8.300878 -0.14602 1.156449
C  -5.074142 0.111308 0.265717
C  -6.617532 2.313161 -1.262709
C  -5.605781 -2.938243 0.176938
C  -6.697991 -0.12626 2.05878
H  2.426127 -1.936293 0.366873
H  1.850447 -2.233075 -1.316584
H  1.567042 1.713497 0.129369
H  2.234142 0.467974 1.258042
H  3.683201 -0.904231 -2.259193
H  4.345807 -2.135137 -1.136655
H  3.503344 1.549182 -1.342472
H  4.113749 1.800942 0.332055
H  -0.001873 -0.778165 0.789295
H  -0.219673 -1.39372 -0.868476
H  6.264631 -2.174206 -0.722682
H  -2.150137 -1.683868 0.378088
H  -2.826863 2.425512 -0.937718
H  8.540099 -2.125582 0.258655
H  7.663704 1.826157 1.850249
H  9.300999 -0.09129 1.594827
H  -7.286362 1.553779 -0.825866
H  -7.093141 3.305297 -1.250402
H  -6.350569 2.038524 -2.301235
H  -6.507723 -2.323668 0.009266
H  -5.159288 -3.227083 -0.793307
H  -5.853711 -3.839018 0.758334
H  -6.371539 0.795812 2.572561
H  -7.787357 -0.24868 2.154072
H  -6.170173 -1.003989 2.471562
