program: Gaussian 09
title: 000292405
version: EM64L-G09RevD.01
frameworkgroup: C1[X(C11H11ClO3)]
method: RPBEPBE
basis: SDD
operation: Freq
keyword: #p
keyword: freq=noraman
keyword: PBEPBE/SDD
title: #p freq=noraman PBEPBE/SDD
converged: YES YES NO NO
title: Mulliken charges:
elementType: Cl O O O C C C C C C C C C C C H H H H H H H H H H H
charge: -0.055702 -0.259027 -0.213932 -0.234861 0.432466 -0.628606 0.167544 -0.299708 -0.329414 0.275275 -0.262235 -0.221539 -0.232912 -0.215976 -0.660249 0.277990 0.284614 0.280064 0.225024 0.235198 0.259452 0.240439 0.240678 0.216274 0.251148 0.227994
chargesum: 0.00000
title: Mulliken charges with hydrogens summed into heavy atoms:
elementType: Cl O O O C C C C C C C C C C C
charge: -0.055702 -0.259027 -0.213932 -0.234861 0.432466 -0.066002 0.167544 -0.299708 -0.049349 0.275275 0.197987 0.037913 0.007527 0.024703 0.035168
polarizability: 1.61854237e+02 6.53134078e-01 1.42995235e+02 -2.91292446e+01 1.59624181e+00 9.56456061e+01
1716.lowfreq: -15.1152 -8.2066 -0.0023 -0.0022 -0.0009 4.1770 15.2826 28.1060 36.9878
frequency: 13.5729 28.0371 36.7551 73.4375 94.1886 103.0681 120.6582 182.0063 214.9102 219.7488 254.7754 287.8360 312.8288 345.4858 408.3070 420.5142 431.0738 480.2600 494.7368 549.5721 571.4960 617.5098 657.4219 683.5062 731.7944 746.5788 770.6284 804.7322 820.9792 877.9535 905.7381 939.2961 969.1352 999.0823 1003.3405 1014.0487 1028.2373 1075.4551 1096.0123 1117.6106 1127.1416 1155.7417 1169.7153 1175.0166 1251.3117 1277.3527 1280.4794 1306.2751 1356.2581 1371.1446 1391.7317 1416.8481 1421.1275 1452.7951 1457.0995 1462.7041 1482.5979 1558.7400 1579.6531 1604.6301 1640.1509 2993.9769 3021.9475 3030.8701 3082.7100 3089.2135 3095.0122 3120.9939 3142.2092 3155.6073 3168.1815 3178.6576
redmass: 3.5783 6.7942 4.7522 6.0747 4.6344 4.9340 4.7295 2.3294 2.1820 5.0014 2.9622 5.4998 3.3991 4.4681 5.7219 5.1749 3.3603 4.2793 3.2264 4.6080 4.5107 5.0832 5.6085 4.0469 3.1066 5.0756 1.3451 1.4008 2.8549 1.4212 3.5643 2.6117 1.4033 1.3992 4.2192 3.5641 3.6942 2.0542 2.2005 2.1560 2.3783 1.6607 1.3399 1.0695 1.5699 1.1769 2.3433 1.7057 1.3112 7.5795 1.2310 1.7574 1.2780 2.3670 1.0954 1.0431 1.0524 6.7494 8.3130 7.1734 9.0266 1.0362 1.0597 1.0596 1.0991 1.0973 1.1033 1.1060 1.0862 1.0903 1.0951 1.1004
irintensity: 0.3655 3.9203 0.1349 1.0534 2.4778 0.1396 1.0306 2.6254 2.7290 4.2418 2.9339 3.5139 14.5349 4.4630 4.4623 12.6387 3.0605 5.8434 6.3848 11.1330 7.4999 15.4800 8.7529 5.3835 7.4857 15.4852 81.7217 2.8429 6.3004 1.2743 8.7768 3.2522 2.9261 1.6826 17.0655 86.9530 10.0183 9.7923 50.7041 118.5552 167.9013 13.7862 54.3199 1.2576 13.6924 8.6279 156.9398 97.7486 5.4271 1.4981 21.5938 90.1433 20.0919 20.2215 11.9547 14.0118 15.5085 40.0333 145.3744 26.4098 153.5731 16.2325 2.3266 32.2000 2.2720 37.2309 0.7434 33.0055 3.2232 4.2120 6.0567 15.0009
temp: 298.150 k
press: 1.00000 atm
elementType: 17 8 8 8 6 6 6 6 6 6 6 6 6 6 6 1 1 1 1 1 1 1 1 1 1 1
symmnumber: 1
zpe: 511524.5 jmol-1
zpe.correction: 0.194829 hartree
zpe.thermalcorrener: 0.209780 hartree
zpe.thermalcorrenthalpy: 0.210725 hartree
zpe.thermalcorrgfe: 0.149670 hartree
zpe.sumelectzpe: -1110.396661 hartree
zpe.sumelectthermal: -1110.381710 hartree
zpe.sumelectthermalent: -1110.380765 hartree
zpe.sumelectthermalfe: -1110.441820 hartree
dipole: -0.3174 -2.9530 -0.3836
dipole: 2.9947
quadrupole: -74.2068 -97.0308 -97.1002
quadrupole: -5.0947 -3.5762 0.5531
quadrupole: 15.2391 -7.5849 -7.6542 -5.0947 -3.5762 0.5531
hfenergy: -1110.5914899 hartree
pointgroup: C01 [X(C11H11Cl1O3)]
dipole: 0.2077985 0.9666455 -0.6407431 debye
dipolederiv: -0.591458 -0.2583396 -0.1421447 -0.2266556 -0.2787734 -0.0583508 -0.1948907 -0.0822442 -0.1292643 -1.5659951 -0.1964469 0.2044872 -0.2011044 -0.360481 0.0608209 0.2316697 0.0463892 -0.5420707 -0.605334 -0.0825213 0.1234688 0.0324566 -0.8116111 0.3945058 -0.0390052 0.3005386 -0.5078364 -0.8051206 -0.0286175 0.0008456 -0.0971904 -0.3300104 -0.0657174 -0.2560381 -0.1568385 -0.7211157 -0.4939935 0.153299 -0.267374 0.091693 -0.3891642 0.2276548 -0.3130718 0.2629651 -0.1986763 -0.4890722 -0.0467527 0.0833731 -0.1067683 0.0116569 0.0733506 0.1419228 0.0335787 -0.2673293 1.2202746 -0.2273795 0.0956009 -0.1985753 0.9716055 -0.6073043 0.2941761 -0.5625412 0.4927234 0.8158809 0.4806907 0.2394987 0.2074606 0.4264354 -0.0483129 0.4492881 0.0469745 0.1479627 0.0624848 -0.1082581 0.1300571 0.0645978 0.016706 -0.0178196 0.0247378 -0.0579626 -0.0531699 1.8508649 0.2065812 -0.1614538 0.3448689 0.2971402 0.0311051 0.0606231 0.1840685 0.9793922 0.6318889 0.0716939 -0.1453959 0.0092969 0.3306991 -0.0906542 -0.4035949 -0.0948924 0.4260241 -0.399875 -0.0075229 -0.1361395 -0.0082599 -0.0063124 -0.0364452 -0.1552012 -0.0470161 -0.1647218 0.0601451 0.1272948 0.072145 0.0718237 -0.1817574 0.050754 0.0909448 0.0802011 -0.1304304 0.1004725 -0.0020864 0.1223229 0.0771939 0.1080404 -0.0549234 0.1013468 -0.0861025 -0.0350927 -0.0376946 0.009352 0.0019722 0.0122301 -0.1106946 0.1018717 0.0982122 0.0787359 -0.0172409 0.0703042 -0.0301049 0.0199718 -0.0308731 0.0620575 -0.0963737 0.0298995 -0.0474849 0.1186527 0.0367386 0.0283733 0.0178297 0.0792224 0.0149982 0.0664924 -0.0064413 0.0407813 0.088748 0.1062411 -0.0203371 -0.0226205 -0.0468867 0.0270196 0.014695 0.0113283 0.0283864 0.1425457 -0.137217 0.0559764 -0.0269843 0.0385523 0.0576773 0.0430209 -0.0439213 0.0667634 0.0243243 0.0618446 -0.0805659 -0.033768 -0.0146603 -0.0447383 -0.0630259 0.0846834 -0.0588521 -0.0231894 0.1039144 -0.0571608 -0.0145926 -0.0371813 -0.0198558 0.0469868 -0.028466 0.0375393 0.132967 -0.0471201 -0.059198 -0.0848729 -0.0753556 0.0684709 -0.0038727 -0.0899216 -0.0026922 0.1197523 0.0222253 0.0518019 -0.0905565 0.0579771 0.0354535 0.0748362 -0.0942836 0.0739074 0.0812507 -0.0288321 -0.015992 0.1399353 -0.028872 0.0840311 0.0149769 0.1688941 0.0254634 -0.0363153 -0.0634915 0.0589831 -0.0844049 0.0171818 0.0584301 0.0133913 -0.1001371 0.0097789 0.0879037 0.1219243 -0.0227627 -0.0412006 -0.0321723 -0.037023 -0.0716625 -0.062754 -0.1194453 -0.0157936 unknown
polarizability: 166.4907908|8.3448143|130.634613|20.8938755|-22.5081452|103.3696749 unknown
InChI: InChI=1S/C11H11ClO3/c1-2-15-11(14)7-10(13)8-5-3-4-6-9(8)12/h3-6H,2,7H2,1H3
charge 0 multiplicity 1
26 atoms
Cl 0.623401 1.553276 0.764506
O  3.218439 -1.133204 0.448885
O  -0.980601 -2.586995 1.912196
O  1.413023 -1.654536 -0.938639
C  -1.215171 -0.634135 0.546037
C  1.118934 -1.486176 1.519207
C  -0.397103 -1.610396 1.359816
C  -0.906109 0.707245 0.201803
C  -2.468059 -1.137119 0.081954
C  1.880685 -1.428255 0.199681
C  4.120646 -1.05698 -0.746056
C  -1.775918 1.508664 -0.564253
C  -3.346173 -0.359972 -0.691666
C  -2.99798 0.970883 -1.020853
C  4.090288 0.347609 -1.353679
H  1.389067 -0.601088 2.120736
H  1.455514 -2.376935 2.079808
H  -2.716444 -2.166916 0.357556
H  5.11075 -1.313011 -0.336728
H  3.798696 -1.819944 -1.476349
H  -1.498211 2.540644 -0.796067
H  -4.292927 -0.785742 -1.038513
H  -3.669057 1.591997 -1.623387
H  4.816341 0.406832 -2.185843
H  3.089021 0.581154 -1.752117
H  4.361747 1.108899 -0.602432
