program: Gaussian 09
title: 000292401
version: EM64L-G09RevD.01
frameworkgroup: C1[X(C14H10N2O3)]
method: RPBEPBE
basis: SDD
operation: Freq
keyword: #p
keyword: freq=noraman
keyword: PBEPBE/SDD
title: #p freq=noraman PBEPBE/SDD
converged: NO YES NO YES
title: Mulliken charges:
elementType: O O O N N C C C C C C C C C C C C C C H H H H H H H H H H
charge: -0.260241 -0.210487 -0.214711 -0.222431 0.015124 0.312081 0.219209 0.321034 0.114390 0.047566 -0.547009 -0.308881 -0.357946 0.398598 -0.342228 -0.663916 -0.434741 -0.237503 -0.236305 0.279138 0.266026 0.234055 0.281104 0.241958 0.241950 0.295246 0.290576 0.237556 0.240788
chargesum: 0.00000
title: Mulliken charges with hydrogens summed into heavy atoms:
elementType: O O O N N C C C C C C C C C C C C C C
charge: -0.260241 -0.210487 -0.214711 -0.222431 0.015124 0.312081 0.219209 0.321034 0.114390 0.047566 -0.267870 -0.042856 -0.123891 0.398598 -0.061124 0.115238 -0.144165 0.000054 0.004483
polarizability: 3.03403025e+02 4.39678518e+00 2.20187012e+02 -1.79848054e-02 7.24271443e-03 6.99376981e+01
1716.lowfreq: -8.5044 -0.0013 -0.0011 -0.0009 5.8530 6.2957 50.6940 61.0769 90.3719
frequency: 50.6671 61.0745 90.3700 98.2827 133.0843 147.5938 200.3665 245.0975 261.3411 273.6965 280.7881 328.0003 358.1793 398.2959 418.1060 430.3926 431.1519 449.1793 506.8840 516.8892 543.4774 571.1630 609.4752 625.1501 657.5919 679.9617 682.4364 696.6257 744.1319 744.9073 789.7164 792.0862 840.1278 849.4130 867.7557 895.7741 939.9651 983.1731 983.4104 984.3620 1010.5823 1016.1429 1042.1483 1092.3941 1098.7085 1108.6881 1122.0562 1146.6806 1180.6740 1199.6055 1214.1775 1242.1039 1277.1783 1289.8333 1312.4107 1327.3156 1360.9561 1394.4286 1407.5160 1425.1240 1433.0586 1446.0395 1477.3709 1488.9402 1501.5563 1505.2462 1566.5190 1577.8628 1607.0698 1614.8523 1622.8235 2994.6464 3083.5647 3128.5071 3138.4567 3153.0732 3164.8334 3175.6693 3179.5252 3189.0110 3197.6953
redmass: 7.8797 9.4534 3.6873 4.7677 8.4060 4.8735 5.0308 1.1050 5.9916 4.2487 7.4077 6.3747 5.0289 4.8857 5.5724 6.9038 3.2843 3.5980 7.8041 3.4427 9.1653 4.3365 5.2715 6.0643 7.5406 4.2586 6.4395 5.0219 9.7705 3.1604 2.1656 2.1157 1.6372 5.4401 5.1158 1.5431 1.5250 1.3709 5.0578 1.3443 1.3445 4.8077 2.1915 2.4220 2.4319 2.0728 1.3146 1.4824 1.1076 2.6192 4.3540 1.6534 2.2461 2.2481 1.9421 3.0312 10.6683 8.2063 3.9779 1.7440 2.3191 2.9621 1.1750 2.7911 1.0449 2.8661 6.9606 8.5752 9.1221 6.2749 7.0688 1.0349 1.1027 1.0987 1.0861 1.0897 1.0949 1.1002 1.0884 1.0905 1.0963
irintensity: 5.7593 0.9721 0.0836 2.6256 2.6342 0.2725 2.3958 0.2968 2.3068 0.6251 0.0423 1.9885 0.0845 14.4762 8.4814 0.3972 1.5663 2.5480 0.1404 0.8414 12.0769 2.0392 3.4409 9.4371 0.6700 4.8433 1.3929 51.8185 17.8061 8.7793 23.8993 23.0839 46.4562 4.2486 0.5777 0.0759 18.5268 1.3976 57.8422 2.4567 0.3283 0.3958 20.0354 74.4387 11.5635 1.2464 0.0313 20.5589 17.1677 136.1800 529.0489 4.7520 96.1481 61.3878 7.7659 16.5316 96.5342 35.7178 14.4326 10.5592 77.7355 9.1632 75.2648 30.9774 20.6025 2.1880 69.9126 111.5578 215.5651 81.7295 7.2000 37.2141 19.6668 1.9372 2.0609 9.3123 7.5369 21.0267 3.6546 0.5847 4.3832
temp: 298.150 k
press: 1.00000 atm
elementType: 8 8 8 7 7 6 6 6 6 6 6 6 6 6 6 6 6 6 6 1 1 1 1 1 1 1 1 1 1
symmnumber: 1
zpe: 560302.1 jmol-1
zpe.correction: 0.213408 hartree
zpe.thermalcorrener: 0.228053 hartree
zpe.thermalcorrenthalpy: 0.228997 hartree
zpe.thermalcorrgfe: 0.171513 hartree
zpe.sumelectzpe: -873.316871 hartree
zpe.sumelectthermal: -873.302226 hartree
zpe.sumelectthermalent: -873.301282 hartree
zpe.sumelectthermalfe: -873.358766 hartree
dipole: -3.1577 1.2092 -0.0006
dipole: 3.3813
quadrupole: -140.6520 -92.5658 -111.2913
quadrupole: 19.7060 -0.0017 0.0012
quadrupole: -25.8156 22.2705 3.5451 19.7060 -0.0017 0.0012
hfenergy: -873.5302787 hartree
pointgroup: C01 [X(C14H10N2O3)]
dipole: -1.2235477 0.522162 -0.000219 debye
polarizability: 303.6159075|1.2534486|219.9741291|-0.0176994|0.0079147|69.9376981 unknown
InChI: InChI=1S/C14H10N2O3/c1-15-13-7-6-9(16(18)19)8-12(13)10-4-2-3-5-11(10)14(15)17/h2-8H,1H3
charge 0 multiplicity 1
29 atoms
O  -3.341396 2.027813 0.000356
O  5.047376 -0.123868 -0.000191
O  3.925169 -2.113118 -0.000163
N  -1.00136 1.983465 0.000231
N  3.95621 -0.819048 -0.000638
C  0.225582 -0.159568 -0.000087
C  0.215432 1.281288 0.000004
C  -1.052182 -0.888243 0.000001
C  -2.267986 -0.140817 0.000205
C  -2.27525 1.339829 0.000413
C  1.473825 -0.823306 -0.0003
C  1.451424 1.996339 -0.000133
C  -1.137581 -2.309992 -0.000138
C  2.672111 -0.091433 -0.000421
C  -3.525144 -0.800337 0.000243
C  -1.007965 3.463607 0.000305
C  2.677057 1.322411 -0.000339
C  -2.384754 -2.956278 -0.000088
C  -3.588298 -2.202145 0.000102
H  1.541528 -1.913064 -0.000377
H  1.452264 3.087473 -0.000069
H  -0.229271 -2.919317 -0.000299
H  -4.427101 -0.180551 0.000403
H  -0.507729 3.856772 -0.901865
H  -0.507335 3.85667 0.9023
H  -2.060509 3.781433 0.000547
H  3.628941 1.858763 -0.000441
H  -2.426326 -4.050738 -0.000202
H  -4.55683 -2.71224 0.00014
