program: Gaussian 09
title: 000292431
version: EM64L-G09RevD.01
frameworkgroup: C1[X(C15H27N3)]
method: RPBEPBE
basis: SDD
operation: Freq
keyword: #pfreq=noraman
keyword: PBEPBE/SDD
title: #p freq=noraman PBEPBE/SDD
converged: YES YES NO NO
title: Mulliken charges:
elementType: N N N C C C C C C C C C C C C C C C H H H H H H H H H H H H H H H H H H H H H H H H H H H
charge: -0.181158 -0.453872 -0.062271 -0.415311 -0.408599 -0.048949 -0.362349 -0.308754 -0.313513 -0.716229 0.436285 -0.702933 -0.684778 -0.434848 -0.342923 0.140890 -0.382110 -0.784572 0.193911 0.199165 0.199252 0.213934 0.204643 0.205782 0.207712 0.191253 0.215446 0.210106 0.196615 0.254239 0.203908 0.215797 0.385706 0.204663 0.266956 0.216441 0.208531 0.234894 0.217944 0.235818 0.221089 0.228464 0.220099 0.221173 0.252451
chargesum: 0.00000
title: Mulliken charges with hydrogens summed into heavy atoms:
elementType: N N N C C C C C C C C C C C C C C C
charge: -0.181158 -0.068166 -0.062271 -0.022235 0.004587 0.155694 0.051145 0.097946 0.093208 -0.042285 0.436285 -0.014872 -0.023409 -0.199030 -0.121834 0.140890 -0.153646 -0.090848
polarizability: 2.27619474e+02 9.35425778e+00 1.92747508e+02 6.70500494e+00 -1.00578950e+01 1.43681491e+02
1716.lowfreq: -35.4752 -15.6446 -7.3301 -4.9107 -0.0007 -0.0002 0.0008 26.6236 36.6326
frequency: -35.3268 26.5949 36.6108 58.2061 71.2599 77.1537 81.5872 105.8823 110.5634 119.1587 158.0371 199.1198 207.1684 216.7613 226.5166 236.7863 259.2520 281.9607 296.9703 302.9493 344.8741 379.8014 382.7262 439.8389 446.0854 447.0591 466.6756 486.2298 505.4406 543.6383 586.2894 607.4082 694.4184 730.5957 745.3796 781.4038 800.0592 804.4138 821.7560 850.9817 855.7438 865.8471 879.6500 913.3108 921.8169 929.2420 946.5254 955.4363 966.4493 995.3725 1012.6624 1019.2553 1046.2308 1052.5500 1073.0348 1078.4774 1087.7105 1092.1902 1097.3218 1108.4239 1135.7027 1141.7485 1171.5415 1185.9860 1206.1587 1225.3595 1244.4129 1278.9808 1283.7930 1285.4044 1291.5089 1296.4428 1302.5587 1339.8904 1343.3941 1345.6808 1357.4323 1360.6403 1366.3178 1376.4987 1383.5979 1386.7439 1395.8050 1398.6355 1428.7749 1452.9466 1457.0416 1459.9501 1465.0538 1468.3358 1470.4658 1470.8997 1472.1274 1474.6309 1478.2489 1483.2322 1484.4757 1488.2642 1492.9773 1515.9963 1601.9183 1611.0145 2876.4789 2885.4651 2892.8662 2896.0171 2970.5800 2978.9239 2980.0868 2982.9815 2986.2547 2989.1224 3012.8408 3025.0149 3030.1386 3039.7672 3044.7200 3047.6885 3056.4155 3076.6895 3077.3950 3081.4880 3089.9134 3095.1998 3099.4313 3112.4934 3113.5735 3144.2878 3148.5470
redmass: 1.0267 3.5045 3.2520 4.3584 2.4052 2.0538 2.5235 3.1307 2.6180 2.9905 3.1436 1.1023 2.0921 1.4867 1.9702 2.9629 2.1262 2.0218 1.9206 3.0733 2.4287 2.8980 2.6854 2.6650 2.5454 2.8585 2.6134 2.3866 2.5665 5.0576 4.4197 4.1426 2.3794 3.2607 3.3647 1.6617 1.2632 1.4158 1.3631 1.3902 1.5774 1.6790 1.7730 2.0953 1.8147 2.0084 1.3840 4.9194 1.9856 1.6523 1.8457 2.0696 1.5739 2.2368 1.9910 2.6362 1.9861 2.0113 1.8430 2.1299 1.8861 1.9434 2.0722 2.2275 2.0869 1.5146 1.1950 1.4285 1.4904 1.2331 1.1669 1.1968 1.7392 1.4283 1.4789 1.3192 1.5284 2.3045 1.2997 1.3659 1.2447 1.2096 1.2185 1.2210 3.6408 1.0933 1.4780 1.0947 1.0847 1.0762 1.2613 1.0945 1.2521 1.0696 1.0651 1.0533 1.0597 1.0607 1.0699 3.5938 5.6671 1.4242 1.0719 1.0720 1.0801 1.0733 1.0627 1.0382 1.0614 1.0377 1.0365 1.0368 1.0887 1.0981 1.0880 1.0968 1.0924 1.0891 1.0974 1.0997 1.0981 1.0975 1.1005 1.0984 1.1002 1.0875 1.0978 1.0946 1.0926
irintensity: 0.3103 0.3048 0.1736 0.0266 0.0807 0.3836 0.3308 0.5877 0.5447 0.8231 0.2005 0.2349 7.9159 0.8498 1.2962 1.1383 2.0911 0.6471 4.1089 6.6801 2.5914 0.6014 3.6392 5.1334 5.1898 2.7988 3.0416 2.6131 1.8274 2.6008 2.1545 6.2300 22.3296 3.0587 8.8389 4.8666 4.9891 3.2877 16.5016 38.8317 51.9199 6.9556 8.3743 2.6026 9.7142 4.0628 0.9060 13.4740 0.9024 25.7676 3.3021 15.4502 7.9464 28.3872 15.3992 11.1830 20.0643 6.8710 5.4577 1.7887 10.5898 26.3496 8.7311 12.7565 15.8814 9.1808 2.3119 21.1959 17.4945 7.2087 12.0328 5.5366 3.1529 3.5221 10.3224 30.6490 0.9820 49.5899 4.5736 1.8161 22.8710 20.2892 15.9236 13.9116 15.1380 11.1665 4.5360 6.2024 3.6505 8.5270 29.8911 9.3391 32.6411 6.3438 3.7081 11.1548 10.2737 16.5892 18.9380 71.5963 462.0049 26.8236 92.0470 128.6085 98.3142 270.4031 21.3473 39.7818 58.8041 41.5235 34.5155 27.1591 848.8025 6.8869 28.7211 55.7800 38.1816 18.1162 25.2304 38.6244 39.0900 49.9504 38.1407 32.0582 20.7612 26.0508 9.4428 49.6477 8.5571
temp: 298.150 k
press: 1.00000 atm
elementType: 7 7 7 6 6 6 6 6 6 6 6 6 6 6 6 6 6 6 1 1 1 1 1 1 1 1 1 1 1 1 1 1 1 1 1 1 1 1 1 1 1 1 1 1 1
symmnumber: 1
zpe: 1043441.7 jmol-1
zpe.correction: 0.397426 hartree
zpe.thermalcorrener: 0.417271 hartree
zpe.thermalcorrenthalpy: 0.418215 hartree
zpe.thermalcorrgfe: 0.348718 hartree
zpe.sumelectzpe: -750.609639 hartree
zpe.sumelectthermal: -750.589794 hartree
zpe.sumelectthermalent: -750.588850 hartree
zpe.sumelectthermalfe: -750.658346 hartree
dipole: 6.3406 1.9355 -1.0728
dipole: 6.7157
quadrupole: -120.2157 -108.1774 -111.7930
quadrupole: -10.6877 2.9097 -2.3278
quadrupole: -6.8203 5.2180 1.6023 -10.6877 2.9097 -2.3278
hfenergy: -751.0070646 hartree
pointgroup: C01 [X(C15H27N3)]
dipole: -2.3034516 0.9107276 0.9195944 debye
polarizability: 225.5403218|-10.8306092|190.6092732|-5.9516709|18.6276648|147.8988783 unknown
InChI: InChI=1S/C15H27N3/c1-5-18(6-2)11-7-8-13(3)17-15-9-10-16-14(4)12-15/h9-10,12-13,17H,5-8,11H2,1-4H3
charge 0 multiplicity 1
45 atoms
N  -2.853361 -0.424293 0.402327
N  -0.251459 0.725342 -0.272671
N  3.120856 -1.728292 -1.223405
C  -1.587095 2.592028 0.663403
C  -2.399004 1.744299 1.682644
C  -0.170813 2.08448 0.291593
C  -3.444582 0.797054 1.044893
C  -2.643349 -1.473571 1.458123
C  -3.710553 -0.928669 -0.719109
C  0.471219 3.079669 -0.71111
C  0.861604 -0.048521 -0.568725
C  -1.761271 -2.661554 1.037461
C  -3.612809 -0.06668 -1.991587
C  2.20017 0.309228 -0.216319
C  0.704008 -1.28999 -1.268794
C  3.280918 -0.540944 -0.552703
C  1.834732 -2.066755 -1.560138
C  4.703347 -0.168768 -0.172174
H  -2.172433 2.696831 -0.273753
H  -1.457364 3.615933 1.06262
H  -2.955306 2.428397 2.353762
H  -1.710631 1.170813 2.334747
H  0.444992 2.07342 1.222289
H  -4.189284 0.488254 1.816919
H  -4.00378 1.362376 0.27728
H  -3.634929 -1.846792 1.81592
H  -2.165922 -0.972464 2.320317
H  -3.374475 -1.95194 -0.961579
H  -4.77562 -1.011097 -0.391293
H  1.45015 2.724109 -1.072165
H  0.614384 4.070396 -0.240556
H  -0.186844 3.199822 -1.590945
H  -1.184244 0.24482 -0.20849
H  -2.196465 -3.239001 0.202389
H  -0.754073 -2.327438 0.738493
H  -1.65303 -3.354953 1.89168
H  -3.982416 0.962231 -1.832001
H  -2.567055 -0.001381 -2.340168
H  -4.221681 -0.515156 -2.797931
H  2.408695 1.230744 0.335767
H  -0.288515 -1.614152 -1.600374
H  1.723738 -3.014226 -2.102016
H  4.996274 0.805679 -0.606305
H  4.818812 -0.088326 0.925408
H  5.391359 -0.944259 -0.543026
