program: Gaussian 09
title: 000292387
version: EM64L-G09RevD.01
frameworkgroup: C1[X(C14H10O3)]
method: RPBEPBE
basis: SDD
operation: Freq
keyword: #pfreq=noraman
keyword: PBEPBE/SDD
title: #p freq=noraman PBEPBE/SDD
converged: YES YES NO YES
title: Mulliken charges:
elementType: O O O C C C C C C C C C C C C C C H H H H H H H H H H
charge: -0.269483 -0.414322 -0.257835 0.251636 0.232583 0.248071 0.204583 0.221547 -0.347362 -0.810579 -0.340162 -0.504431 -0.523476 -0.427952 0.322660 -0.363850 0.155880 0.248921 0.245381 0.245869 0.245397 0.217946 0.293254 0.282318 0.228138 0.251688 0.363580
chargesum: 0.00000
title: Mulliken charges with hydrogens summed into heavy atoms:
elementType: O O O C C C C C C C C C C C C C C
charge: -0.269483 -0.050742 -0.257835 0.251636 0.232583 0.248071 0.204583 0.221547 -0.098441 -0.073931 -0.122216 -0.211177 -0.241158 -0.199814 0.322660 -0.112163 0.155880
polarizability: 3.63736914e+02 -2.43665613e+01 1.69506047e+02 -7.19124514e-03 2.38267081e-03 6.60804014e+01
1716.lowfreq: -9.9057 -3.9981 -0.0009 0.0003 0.0007 5.3935 55.6827 77.2301 101.5473
frequency: 55.6771 77.2287 101.5291 133.2107 176.7433 176.8062 238.3532 257.6097 290.0247 311.1280 331.6136 348.6267 374.9473 409.1255 428.5948 455.1474 471.4452 478.3725 523.1125 533.3533 579.7064 608.3680 610.9512 633.9113 676.9166 724.6698 735.9680 740.7250 752.8517 793.2633 813.7179 823.4799 867.2144 874.2128 896.0347 929.1968 956.9995 974.0978 1031.0360 1033.8623 1059.3697 1094.2499 1107.5463 1143.7292 1165.4830 1192.4433 1214.9312 1247.7071 1283.3993 1295.1343 1327.3860 1370.6166 1383.8450 1403.0168 1429.3596 1447.0214 1463.5046 1470.7338 1498.8700 1510.0816 1556.7548 1561.9908 1584.5768 1618.0933 1653.0942 2983.4049 3052.0158 3127.7122 3128.8795 3143.2193 3167.3915 3167.7489 3178.4330 3191.9245 3581.9299
redmass: 6.1417 5.0771 2.3779 1.2584 7.0305 5.5467 4.6609 6.5072 4.2666 5.3815 7.7276 4.8695 1.1224 5.3449 3.0858 2.9651 5.4911 5.9525 4.3806 4.0705 8.7391 6.2019 4.0042 3.1089 6.1257 3.5316 7.1522 7.4645 3.2091 1.5543 1.5883 2.8542 1.5355 1.6808 3.5325 1.3333 3.2596 1.3155 1.5616 4.8962 1.7693 2.7746 1.9289 1.4744 1.3515 1.9804 1.4387 2.0923 1.9249 3.7757 3.1579 2.0499 3.8284 1.3168 7.0545 3.7282 1.4601 1.0452 2.7368 4.6979 6.2220 8.0879 6.5398 6.6866 7.6533 1.0414 1.0968 1.0928 1.0906 1.0858 1.0970 1.0946 1.0928 1.0933 1.0662
irintensity: 0.2113 1.1072 1.0775 0.5033 0.1846 4.8393 1.9752 0.8980 3.9734 0.0422 4.8311 14.1065 142.3495 0.6566 7.1360 1.0276 8.8931 4.4471 21.2678 0.0320 3.3141 4.6606 7.3052 22.7137 2.5681 2.4651 0.9496 2.5685 0.8722 38.5320 12.9091 18.6042 16.6691 81.5231 15.5670 0.5463 35.8213 0.8592 2.7364 8.4343 14.9721 220.6115 57.1073 109.6812 8.0472 16.4157 38.8889 5.2585 72.8035 34.5412 11.5578 54.5209 81.4892 19.4105 22.8815 34.2336 83.0184 15.8377 31.7253 251.6341 11.8872 100.8193 75.6147 507.0477 44.6914 22.3213 11.5204 19.4398 4.4058 4.8177 23.9333 11.9155 0.1364 1.1633 106.4278
temp: 298.150 k
press: 1.00000 atm
elementType: 8 8 8 6 6 6 6 6 6 6 6 6 6 6 6 6 6 1 1 1 1 1 1 1 1 1 1
symmnumber: 1
zpe: 526568.8 jmol-1
zpe.correction: 0.200559 hartree
zpe.thermalcorrener: 0.214241 hartree
zpe.thermalcorrenthalpy: 0.215185 hartree
zpe.thermalcorrgfe: 0.160552 hartree
zpe.sumelectzpe: -763.977534 hartree
zpe.sumelectthermal: -763.963852 hartree
zpe.sumelectthermalent: -763.962908 hartree
zpe.sumelectthermalfe: -764.017542 hartree
dipole: -8.3460 6.1003 0.0005
dipole: 10.3378
quadrupole: -104.5265 -92.9877 -101.7484
quadrupole: 8.8199 0.0000 -0.0001
quadrupole: -4.7723 6.7665 -1.9942 8.8199 0.0000 -0.0001
hfenergy: -764.1780934 hartree
pointgroup: C01 [X(C14H10O3)]
dipole: -3.2839279 2.3995615 0.0001967 debye
polarizability: 363.7438926|-24.3387302|169.4990679|-0.0071916|0.0023816|66.0804014 unknown
InChI: InChI=1S/C14H10O3/c1-8-11-4-2-9(15)6-13(11)17-14-7-10(16)3-5-12(8)14/h2-7,15H,1H3
charge 0 multiplicity 1
27 atoms
O  -0.025899 -1.357169 -0.000146
O  -4.780319 -1.535535 0.000024
O  4.758767 -1.55555 -0.000227
C  0.04092 1.519757 -0.000091
C  -1.224123 0.79465 -0.000047
C  1.240866 0.789259 -0.000105
C  -1.219554 -0.637662 -0.000083
C  1.216528 -0.67618 -0.000125
C  -2.502052 1.428137 0.000032
C  -0.005557 3.032037 -0.000094
C  2.569967 1.385471 -0.000127
C  -2.396391 -1.402834 -0.000061
C  2.345667 -1.462743 -0.000124
C  -3.693732 0.68885 0.000062
C  -3.635637 -0.733665 0.000009
C  3.714997 0.62245 -0.000128
C  3.679981 -0.858597 -0.000051
H  -2.560538 2.520103 0.000081
H  -0.54613 3.4070 -0.889785
H  0.991935 3.491093 -0.000463
H  -0.545495 3.407015 0.889982
H  2.65847 2.47586 -0.000137
H  -2.349706 -2.493681 -0.000095
H  2.264852 -2.553015 -0.000156
H  -4.662218 1.203566 0.000125
H  4.708528 1.084307 -0.000156
H  -5.605027 -0.988522 0.000083
