program: Gaussian 09
title: 000292389
version: EM64L-G09RevD.01
frameworkgroup: C1[X(C14H8O5)]
method: RPBEPBE
basis: SDD
operation: Freq
keyword: #pfreq=noraman
keyword: PBEPBE/SDD
title: #p freq=noraman PBEPBE/SDD
converged: NO YES NO NO
title: Mulliken charges:
elementType: O O O O O C C C C C C C C C C C C C C H H H H H H H H
charge: -0.267077 -0.410456 -0.418214 -0.236818 -0.243189 0.227124 0.250791 0.148709 0.190722 0.209385 -0.317107 -0.275207 -0.502515 -0.515812 -0.426529 0.324168 -0.355745 0.081550 0.159493 0.281581 0.268487 0.294766 0.286394 0.231831 0.256104 0.366552 0.391012
chargesum: 0.00000
title: Mulliken charges with hydrogens summed into heavy atoms:
elementType: O O O O O C C C C C C C C C C C C C C
charge: -0.267077 -0.043904 -0.027202 -0.236818 -0.243189 0.227124 0.250791 0.148709 0.190722 0.209385 -0.035526 -0.006720 -0.207749 -0.229418 -0.194698 0.324168 -0.099641 0.081550 0.159493
polarizability: 3.78841734e+02 -3.06684266e+01 1.91833746e+02 1.06008693e+00 -1.33258373e+00 6.83741768e+01
1716.lowfreq: -4.1022 -0.0003 0.0002 0.0008 3.9759 4.8047 52.6197 54.8673 69.5696
frequency: 52.6119 54.8552 69.5692 81.8241 173.1799 176.4523 188.6519 210.1594 249.2817 309.1507 314.2276 325.5322 335.6423 353.8886 389.9899 417.1450 425.5028 448.8514 462.9151 485.0281 560.6572 575.3553 588.6914 609.2647 610.1227 618.0333 645.2670 676.8936 712.6960 725.1099 727.7701 740.1862 767.4082 802.3217 822.4489 866.8166 877.5213 888.4423 907.0619 938.4276 942.6098 964.4729 980.9588 1061.3494 1093.9121 1106.1878 1145.8755 1170.4432 1192.9755 1218.0478 1244.1516 1271.5610 1289.4923 1298.6579 1325.4119 1376.0852 1388.8941 1424.5912 1444.5391 1479.6588 1499.9643 1543.0592 1559.8796 1570.6242 1611.9378 1626.7414 1651.9947 3133.6674 3156.8422 3180.9029 3191.3172 3194.1285 3198.8088 3500.6606 3581.4411
redmass: 7.1561 8.3982 7.1799 5.7763 6.0599 7.4979 8.0071 6.4216 6.7459 5.3923 7.6921 8.7194 8.8212 9.6435 1.1274 5.1221 3.4558 3.2852 4.4053 4.2868 5.6945 5.9526 6.9144 3.1407 5.8753 2.2046 2.0630 5.5488 4.7727 5.1162 4.8741 7.9704 2.9788 1.6621 1.7300 1.5402 1.6998 5.3452 4.0286 2.1922 2.3771 3.1503 1.3239 2.9195 2.6133 1.8907 1.4949 1.3784 2.0531 1.4535 1.9522 2.7275 1.9577 3.1051 2.8476 3.9463 2.3295 7.4282 4.6464 5.7406 3.9131 6.9782 8.4166 7.4651 7.2079 7.6530 7.5744 1.0910 1.0901 1.0928 1.0933 1.0937 1.0948 1.0639 1.0662
irintensity: 0.3321 4.9876 1.2588 0.5340 5.4183 1.1547 1.7901 2.3729 0.3290 0.6403 10.7726 3.2682 0.1476 7.4506 140.6772 0.0984 10.5642 2.7335 5.1231 2.7889 44.2139 41.7454 26.5645 10.1985 9.1891 34.5001 107.3222 4.4963 12.1831 2.7556 5.7685 1.7593 6.3080 24.3045 12.7388 25.7608 75.5525 28.7335 5.7200 23.8587 10.4176 74.1083 0.5348 216.1238 277.9669 45.4849 120.8836 15.1092 20.7915 43.7383 8.8877 34.8506 73.5334 12.4192 49.3400 43.9173 90.3238 5.1506 16.5891 244.9187 78.0182 45.5870 74.1445 103.2950 170.3195 557.9719 46.2686 14.9147 3.9000 0.3216 3.0268 2.0739 5.8203 49.7397 124.8317
temp: 298.150 k
press: 1.00000 atm
elementType: 8 8 8 8 8 6 6 6 6 6 6 6 6 6 6 6 6 6 6 1 1 1 1 1 1 1 1
symmnumber: 1
zpe: 489313.3 jmol-1
zpe.correction: 0.186370 hartree
zpe.thermalcorrener: 0.201385 hartree
zpe.thermalcorrenthalpy: 0.202329 hartree
zpe.thermalcorrgfe: 0.144063 hartree
zpe.sumelectzpe: -913.091918 hartree
zpe.sumelectthermal: -913.076903 hartree
zpe.sumelectthermalent: -913.075959 hartree
zpe.sumelectthermalfe: -913.134225 hartree
dipole: -6.6412 4.4886 0.7989
dipole: 8.0555
quadrupole: -107.7007 -106.6930 -112.6795
quadrupole: 16.9104 -1.6032 4.1742
quadrupole: 1.3237 2.3314 -3.6551 16.9104 -1.6032 4.1742
hfenergy: -913.278288 hartree
pointgroup: C01 [X(C14H8O5)]
dipole: 2.6350516 1.7282891 -0.3373761 debye
polarizability: 379.2952196|29.0348699|191.2032321|5.2927225|-3.0246773|68.5512059 unknown
InChI: InChI=1S/C14H8O5/c15-7-1-3-9-11(5-7)19-12-6-8(16)2-4-10(12)13(9)14(17)18/h1-6,15,17H
charge 0 multiplicity 1
27 atoms
O  0.075208 -1.721694 -0.005505
O  4.821667 -1.89202 0.061996
O  -0.943851 3.20123 -0.930162
O  0.81188 3.359585 0.561542
O  -4.699013 -1.9845 0.036409
C  1.267148 0.439861 -0.003525
C  -1.22003 0.405831 -0.058549
C  -0.01503 1.135915 -0.060339
C  1.265797 -0.993676 0.008927
C  -1.17168 -1.059573 -0.01392
C  2.547841 1.074242 0.011106
C  -2.556775 0.988291 -0.051168
C  2.43999 -1.760277 0.029357
C  -2.290191 -1.860816 0.013549
C  3.734154 0.330627 0.03096
C  3.679188 -1.092033 0.040698
C  -3.687466 0.206637 -0.013564
C  0.0106 2.634078 -0.075733
C  -3.630349 -1.272357 0.015447
H  2.601715 2.164024 0.031202
H  -2.644708 2.074729 -0.090779
H  2.390297 -2.850796 0.037685
H  -2.194817 -2.9495 0.037252
H  4.701164 0.847416 0.046378
H  -4.687229 0.654171 -0.00557
H  5.646963 -1.345884 0.073931
H  -0.848275 4.193084 -0.897825
