program: Gaussian 09
title: 000292429
version: EM64L-G09RevD.01
frameworkgroup: C1[X(C26H26N2O2S)]
method: RPBEPBE
basis: SDD
operation: Freq
keyword: #p
keyword: freq=noraman
keyword: PBEPBE/SDD
title: #p freq=noraman PBEPBE/SDD
converged: YES YES YES YES
title: Mulliken charges:
elementType: S O O N N C C C C C C C C C C C C C C C C C C C C C C C C C C H H H H H H H H H H H H H H H H H H H H H H H H H H
charge: 0.327578 -0.260203 -0.260204 -0.049214 -0.049213 0.102304 0.102304 0.562470 0.562470 -0.698558 -0.698566 -0.745962 -0.698562 -0.698561 -0.745963 -0.549451 -0.549452 -0.390300 -0.390299 0.036630 0.036630 0.237036 0.237036 -0.402734 -0.402735 0.247252 0.247252 -0.260185 -0.260185 -0.300382 -0.300382 0.210727 0.214318 0.224808 0.214307 0.210727 0.224811 0.221920 0.219522 0.219530 0.210727 0.214308 0.224811 0.214317 0.210727 0.224808 0.221920 0.219529 0.219523 0.274669 0.274669 0.234192 0.234192 0.253434 0.253434 0.283110 0.283110
chargesum: 0.00000
title: Mulliken charges with hydrogens summed into heavy atoms:
elementType: S O O N N C C C C C C C C C C C C C C C C C C C C C C C C C C
charge: 0.327578 -0.260203 -0.260204 -0.049214 -0.049213 0.102304 0.102304 0.562470 0.562470 -0.048705 -0.048721 -0.084990 -0.048717 -0.048708 -0.084991 -0.274782 -0.274783 -0.156108 -0.156107 0.036630 0.036630 0.237036 0.237036 -0.149301 -0.149301 0.247252 0.247252 -0.260185 -0.260185 -0.017272 -0.017273
polarizability: 8.58277632e+02 -6.39681110e-05 2.95404249e+02 3.01086376e-04 3.07273709e-03 1.68783848e+02
1716.lowfreq: -0.0022 0.0024 0.0025 3.4522 4.6448 7.7380 17.6963 21.3846 24.5821
frequency: 16.9451 21.3550 24.5821 37.4331 41.9877 66.4482 69.0281 75.8302 92.3446 115.4614 121.1398 151.7107 181.5385 185.6540 209.2225 212.5450 231.2353 246.4332 258.2581 258.4760 259.2932 261.2890 281.4152 292.6984 306.3442 311.3482 311.5099 315.0172 337.4531 344.4594 347.5812 358.4393 369.0591 398.6167 421.5040 430.1139 439.0793 449.2230 451.3777 451.4144 492.7804 499.6633 512.7137 524.3261 533.0540 575.0128 587.5387 606.6564 644.5206 648.0046 648.9593 686.0121 686.7275 688.0400 690.3213 712.9049 754.4072 754.5259 783.3238 788.4281 823.8927 823.9175 825.6256 825.6926 834.8577 842.0388 843.8979 904.6296 904.6380 909.6386 919.8830 921.0220 921.0268 932.3431 932.5921 935.0148 938.5515 941.6210 941.6245 949.4381 956.2698 956.2870 1021.8066 1021.8250 1026.5315 1026.5322 1046.2464 1077.9263 1078.2412 1116.2676 1117.1113 1155.5066 1170.1252 1184.9116 1187.2678 1205.1121 1206.4636 1206.4662 1212.0828 1214.7476 1225.2730 1250.7347 1269.4975 1271.8402 1285.4348 1286.3927 1343.7301 1375.4199 1375.8515 1376.9512 1376.9547 1379.3850 1379.3905 1406.5681 1406.6033 1425.5355 1427.0999 1456.8028 1460.8323 1461.1533 1461.7299 1461.7302 1465.9540 1465.9593 1470.2347 1470.2700 1477.7576 1483.5260 1483.8898 1487.7655 1487.7669 1498.5536 1498.5993 1553.9583 1577.0031 1609.1181 1613.7118 1622.1454 1626.4964 2973.5108 2973.5165 2974.3321 2974.3376 2979.8006 2979.8611 3069.6622 3069.6641 3069.8488 3069.8506 3070.6313 3070.6362 3078.4727 3078.6112 3078.8480 3078.8553 3082.1904 3082.2111 3140.9233 3140.9377 3176.2966 3176.3369 3186.6877 3186.7080 3189.0565 3206.3431
redmass: 5.3997 3.0463 5.6856 4.9356 3.2486 5.1224 6.7375 6.4044 4.8438 4.5865 5.0572 5.6277 4.5987 4.4754 1.2628 1.1456 3.7482 3.6466 3.0815 3.1263 1.1135 1.0687 3.4058 5.3641 3.8588 1.0875 1.0898 3.1120 3.6890 2.9746 3.9175 2.6184 3.1379 4.0436 3.5240 3.8827 3.4898 3.4762 3.2328 3.2845 4.2402 6.5039 4.3233 3.8544 4.2874 3.6038 6.1896 6.2790 10.0669 3.7752 3.6866 8.4317 6.3303 7.7181 6.2328 6.4854 4.3694 4.3826 6.1532 6.2745 1.4607 1.4571 3.1404 3.2428 1.2970 10.3100 11.5714 1.5381 1.5383 4.8524 3.8839 1.6609 1.6608 1.6892 1.6771 1.3992 4.7098 1.2227 1.2223 7.2344 1.3217 1.3215 1.4120 1.4138 1.3774 1.3775 1.6289 2.0174 2.0270 2.2139 2.1893 4.7939 3.3942 1.8221 2.0382 2.4186 2.9745 2.9744 2.8035 2.6115 3.4791 2.1580 1.9611 1.9384 2.1353 2.3408 4.4131 4.0735 4.0115 1.1843 1.1843 1.3111 1.2968 1.2116 1.2119 4.2034 4.2403 7.2523 2.3499 2.4150 1.0506 1.0506 1.0478 1.0478 1.1517 1.1549 4.7170 1.0766 1.1350 1.0503 1.0503 1.0832 1.0842 8.9097 7.5007 8.6299 8.5846 8.0360 8.5630 1.0351 1.0351 1.0346 1.0346 1.0358 1.0358 1.1003 1.1003 1.0999 1.0999 1.1005 1.1005 1.0987 1.0987 1.0996 1.0996 1.0991 1.0991 1.0882 1.0882 1.0960 1.0960 1.0916 1.0916 1.0907 1.1010
irintensity: 0.2803 0.0000 0.2279 0.0000 0.1355 0.0000 0.6934 0.3669 2.6597 0.0000 0.1422 0.3766 0.5702 0.7530 0.0000 0.3477 0.0000 1.4321 0.0000 0.0187 0.1196 0.0248 1.9285 1.0888 0.3501 0.0000 0.0849 0.1736 0.0000 0.0491 7.1825 0.9576 0.0000 1.8662 2.0288 0.0000 0.0366 1.8985 0.0006 4.4848 0.4985 11.6128 0.1490 0.0411 0.8322 0.0000 0.1150 8.6603 4.8778 0.0000 11.2795 0.0000 0.3865 34.3069 2.0670 2.4224 3.0947 0.0000 10.4137 60.7014 0.1548 89.8828 44.2888 0.2141 38.1712 17.4410 9.8498 19.2008 0.2076 1.8771 19.3326 0.2443 13.1100 7.9579 0.7586 0.0000 19.8830 0.0182 1.7387 116.2422 0.0015 0.6258 20.2941 0.7785 0.0623 0.2697 31.0778 17.8506 0.0008 11.3486 5.6273 0.0070 32.4556 23.1454 2.1474 6.6218 0.5545 12.6905 0.0551 0.1035 5.9072 117.3515 0.2164 36.0298 7.8255 32.5495 23.0964 31.5969 0.3094 0.9303 37.3352 58.5949 5.0081 30.0396 1.9395 0.0077 5.6598 0.2140 6.1638 1.3021 0.0060 0.0076 0.0022 1.0189 1.7665 1.3132 184.2315 29.2377 2.6922 0.3067 23.6707 2.2324 71.8401 2.6079 201.6702 0.4036 28.9397 0.7698 15.0965 3.9142 55.2048 3.1947 62.3314 93.3327 0.0361 0.2552 0.7213 0.0745 5.3616 2.1502 33.8182 354.9810 0.1679 4.2444 62.9765 14.0789 89.6462 19.2796 8.8834 4.6317 12.7893 5.6353 1.2203 2.8205 0.2297
temp: 298.150 k
press: 1.00000 atm
elementType: 16 8 8 7 7 6 6 6 6 6 6 6 6 6 6 6 6 6 6 6 6 6 6 6 6 6 6 6 6 6 6 1 1 1 1 1 1 1 1 1 1 1 1 1 1 1 1 1 1 1 1 1 1 1 1 1 1
symmnumber: 1
zpe: 1189376.4 jmol-1
zpe.correction: 0.453010 hartree
zpe.thermalcorrener: 0.481631 hartree
zpe.thermalcorrenthalpy: 0.482576 hartree
zpe.thermalcorrgfe: 0.392918 hartree
zpe.sumelectzpe: -1662.165608 hartree
zpe.sumelectthermal: -1662.136986 hartree
zpe.sumelectthermalent: -1662.136041 hartree
zpe.sumelectthermalfe: -1662.225699 hartree
dipole: 0.0000 -1.3222 0.0005
dipole: 1.3222
quadrupole: -131.1237 -181.9129 -196.2081
quadrupole: 0.0000 -0.0003 0.0006
quadrupole: 38.6246 -12.1647 -26.4599 0.0000 -0.0003 0.0006
hfenergy: -1662.6186171 hartree
pointgroup: C01 [X(C26H26N2O2S1)]
dipole: -0.0000006 0.5201847 0.0003016 debye
polarizability: 858.2776319|0.000563|295.404244|-0.0081466|0.0256299|168.7838536 unknown
InChI: InChI=1S/C26H26N2O2S/c1-25(2,3)15-7-9-19-17(13-15)27-23(29-19)21-11-12-22(31-21)24-28-18-14-16(26(4,5)6)8-10-20(18)30-24/h7-14H,1-6H3
charge 0 multiplicity 1
57 atoms
S  -0.000003 0.414439 0.000221
O  3.012268 0.860936 0.00039
O  -3.012274 0.860929 0.000487
N  3.718163 -1.359792 0.000027
N  -3.718164 -1.359801 0.000145
C  8.693673 -0.01263 0.000706
C  -8.693676 -0.012649 0.000891
C  7.165659 0.236676 0.00059
C  -7.165663 0.236659 0.000762
C  9.32307 0.632585 1.272841
C  9.323427 0.633456 -1.270808
C  9.045186 -1.522498 0.000239
C  -9.323435 0.633382 -1.27065
C  -9.32307 0.63262 1.2730
C  -9.045186 -1.522518 0.000486
C  6.228383 -0.822824 0.000318
C  -6.228385 -0.822839 0.000459
C  6.687988 1.589367 0.000799
C  -6.687995 1.589352 0.000972
C  4.851953 -0.510054 0.000267
C  -4.851956 -0.510066 0.000393
C  4.425166 0.847022 0.00048
C  -4.425172 0.847012 0.000616
C  5.316084 1.924937 0.000742
C  -5.316093 1.924924 0.000903
C  2.667058 -0.53973 0.000143
C  -2.667061 -0.539737 0.000217
C  1.269319 -0.870923 0.000042
C  -1.269321 -0.870926 0.000076
C  0.711946 -2.155034 -0.0002
C  -0.711945 -2.155036 -0.000185
H  10.417284 0.470981 1.278523
H  9.142327 1.721587 1.314299
H  8.901555 0.184208 2.190997
H  9.142716 1.72249 -1.31156
H  10.417642 0.471841 -1.276293
H  8.902163 0.185726 -2.189395
H  10.143561 -1.645341 0.000403
H  8.651317 -2.036292 0.896664
H  8.651661 -2.035657 -0.896701
H  -10.417646 0.471748 -1.276135
H  -9.142742 1.722417 -1.311439
H  -8.902158 0.185627 -2.189218
H  -9.142305 1.721619 1.314421
H  -10.417288 0.471036 1.27868
H  -8.901569 0.184266 2.191174
H  -10.143561 -1.645363 0.000568
H  -8.651582 -2.03573 -0.896389
H  -8.651393 -2.036258 0.896975
H  6.540714 -1.868946 0.000161
H  -6.540714 -1.868961 0.00029
H  7.415467 2.408263 0.001008
H  -7.415478 2.408245 0.001196
H  4.975988 2.963473 0.000905
H  -4.975999 2.963461 0.001067
H  1.335246 -3.051238 -0.000348
H  -1.335243 -3.051242 -0.000317
