program: Gaussian 09
title: 000292582
version: EM64L-G09RevD.01
frameworkgroup: C1[X(C21H13ClFNO2S2)]
method: RPBEPBE
basis: SDD
operation: Freq
keyword: #p
keyword: freq=noraman
keyword: PBEPBE/SDD
title: #p freq=noraman PBEPBE/SDD
converged: YES YES NO NO
title: Mulliken charges:
elementType: Cl S S F O O N C C C C C C C C C C C C C C C C C C C C C H H H H H H H H H H H H H
charge: -0.010436 1.082593 0.229283 -0.342667 -0.475187 -0.472953 -0.039952 0.504522 -0.127861 0.022977 0.368408 -0.322559 -0.153813 -0.233940 -0.230566 -0.286768 -0.212778 -0.256663 -0.383025 -0.225249 -0.212477 -0.264351 -0.232739 -0.228561 -0.231191 -0.215656 -0.215089 -0.225484 0.307641 0.259727 0.283302 0.291385 0.235511 0.286161 0.235722 0.248937 0.265259 0.264982 0.238080 0.237995 0.237478
chargesum: 0.00000
title: Mulliken charges with hydrogens summed into heavy atoms:
elementType: Cl S S F O O N C C C C C C C C C C C C C C C C C C C C C
charge: -0.010436 1.082593 0.229283 -0.342667 -0.475187 -0.472953 -0.039952 0.504522 -0.127861 0.022977 0.368408 -0.014918 -0.153813 -0.233940 0.029161 -0.003466 0.078608 -0.021152 -0.096864 -0.225249 0.023245 -0.015414 -0.232739 0.036698 0.033792 0.022424 0.022906 0.011994
polarizability: 5.01545498e+02 -2.59588321e+01 3.47513220e+02 -5.29417305e+00 9.54931237e-01 1.60570508e+02
1716.lowfreq: -13.5969 -8.2609 -5.0687 -2.3156 -0.0008 0.0008 0.0015 5.1043 18.5644
frequency: -11.8944 4.7318 18.3729 20.8308 27.2950 32.4877 62.8170 80.9652 100.5960 113.9395 140.3709 157.3860 173.6062 176.8235 193.5435 197.9525 223.6648 234.9778 250.5469 265.7872 284.0141 302.7625 316.7084 344.3536 369.6394 395.9173 404.2341 413.6262 420.1546 427.3987 431.6727 441.3292 506.5121 508.3740 522.1633 540.7290 545.7468 553.4245 608.1592 609.5683 619.3461 650.0775 675.9761 679.8850 680.2381 696.8550 707.4171 757.8484 769.8321 778.0630 809.5483 810.7885 842.3367 851.6994 853.5778 873.5501 883.6215 893.3609 913.6153 930.2803 934.2166 948.6596 980.9997 983.1798 984.4168 985.4644 994.9443 1000.5283 1001.2736 1014.1968 1047.2701 1054.1765 1070.3335 1070.8866 1080.7820 1104.0186 1133.7741 1173.8825 1181.4458 1182.4331 1184.5259 1239.0985 1277.6011 1295.3081 1300.3088 1300.5940 1338.9606 1362.5276 1371.8164 1378.4205 1391.5824 1416.1933 1425.4004 1440.5837 1457.8867 1460.1488 1487.4751 1530.7218 1568.6288 1585.2399 1585.7577 1586.7851 1594.0667 1609.4411 3133.0878 3134.8469 3142.0792 3153.7769 3154.8785 3157.2983 3158.3475 3162.1774 3163.3597 3173.0120 3181.1089 3182.5460 3193.2161
redmass: 6.4274 10.0842 4.5508 10.6559 6.6627 6.9714 9.0565 7.5473 12.2673 6.8525 8.4831 6.7029 6.4602 8.3409 5.0507 6.7966 7.3739 8.9132 7.1206 5.9153 9.4233 11.5558 7.7621 13.2295 7.0367 9.0934 2.8224 3.2635 10.3107 6.9816 3.3749 9.1967 4.2539 4.4043 7.1023 5.9719 5.3121 8.4591 8.3987 6.4827 6.7710 7.3710 7.9064 6.0270 3.2557 2.2111 2.3624 1.6253 6.0869 2.6039 1.8066 3.5420 1.6970 15.0793 1.2457 8.0137 1.8248 1.4268 1.4495 1.3666 1.4186 5.8246 1.3868 6.0880 1.3518 6.3729 15.7539 1.3565 1.3186 3.3572 2.5350 2.9423 2.1628 1.6440 2.0987 1.7514 1.4776 1.0550 1.0937 1.1173 2.1333 1.4171 2.4848 3.0686 1.3430 1.4039 4.5375 2.8011 9.9267 5.7831 7.6657 3.4234 2.0628 2.9406 2.0941 3.2331 3.4076 7.6518 6.7607 6.6765 6.3051 7.0303 6.3337 7.4103 1.0853 1.0876 1.0886 1.0929 1.0944 1.0924 1.0904 1.0969 1.0889 1.1016 1.0958 1.0979 1.0917
irintensity: 1.0251 0.2245 0.2074 0.1581 0.3467 0.2716 0.5220 2.3134 2.1532 0.8115 0.2160 0.9272 0.8475 1.2427 5.3724 2.0838 2.8556 2.2846 3.0745 0.1407 8.5819 3.2345 11.8222 1.8455 3.0641 29.6406 0.0084 1.3916 6.5621 7.0623 5.8989 70.3880 34.9830 3.1506 2.6211 41.1774 0.8872 104.7135 64.0162 0.2418 24.1803 12.4531 17.8976 6.8421 13.6457 49.1743 13.5155 51.1698 55.7815 2.9711 39.8668 19.5250 40.9181 107.0040 0.3557 66.5297 2.3815 10.0181 21.1312 5.2594 1.5328 8.1707 0.0063 4.7584 1.9112 6.0542 71.6278 1.1431 0.1960 11.1882 53.6314 5.6032 7.2443 7.3712 6.0067 21.5828 0.9723 0.0004 6.5833 3.1037 29.0401 22.3079 66.2435 55.9332 2.3300 5.9937 120.8414 29.1871 1.4122 14.4810 16.0155 64.1646 11.2003 62.1274 20.2053 20.0805 74.4851 98.0906 152.8035 79.5290 3.9824 68.3959 16.2864 103.6543 0.2702 3.4492 4.3453 13.9293 15.4246 8.1801 1.0712 16.3616 4.7589 13.3625 9.9427 1.0647 0.1311
temp: 298.150 k
press: 1.00000 atm
elementType: 17 16 16 9 8 8 7 6 6 6 6 6 6 6 6 6 6 6 6 6 6 6 6 6 6 6 6 6 1 1 1 1 1 1 1 1 1 1 1 1 1
symmnumber: 1
zpe: 737538.4 jmol-1
zpe.correction: 0.280914 hartree
zpe.thermalcorrener: 0.304980 hartree
zpe.thermalcorrenthalpy: 0.305924 hartree
zpe.thermalcorrgfe: 0.222202 hartree
zpe.sumelectzpe: -2367.171277 hartree
zpe.sumelectthermal: -2367.147211 hartree
zpe.sumelectthermalent: -2367.146267 hartree
zpe.sumelectthermalfe: -2367.229989 hartree
dipole: -7.4220 0.7283 -0.5620
dipole: 7.4788
quadrupole: -238.5762 -165.0201 -184.3817
quadrupole: 17.0724 -3.3488 0.2414
quadrupole: -42.5835 30.9725 11.6110 17.0724 -3.3488 0.2414
hfenergy: -2367.4521909 hartree
pointgroup: C01 [X(C21H13Cl1F1N1O2S2)]
dipole: -2.8907783 0.4955755 -0.2353466 debye
polarizability: 496.6149636|-37.7585509|351.8487308|-4.8231742|-10.1388528|161.1655316 unknown
InChI: InChI=1S/C21H13ClFNO2S2/c22-19-13-21(24-20-10-9-17(12-18(19)20)28(23,25)26)14-5-4-8-16(11-14)27-15-6-2-1-3-7-15/h1-13H
charge 0 multiplicity 1
41 atoms
Cl 0.996895 -2.946194 0.250846
S  6.341343 -1.09557 -0.007488
S  -5.587962 1.186868 0.044503
F  6.683625 -0.929557 1.812553
O  6.200193 -2.669574 -0.296917
O  7.437388 -0.174497 -0.736246
N  0.988085 1.690405 -0.057748
C  2.271067 -0.444165 0.053748
C  2.183224 1.005833 -0.039675
C  -0.175785 0.995224 0.016908
C  -1.440939 1.780851 -0.003422
C  3.54732 -1.077313 0.072274
C  4.6699 -0.264217 -0.014014
C  1.01682 -1.134189 0.129812
C  -0.18576 -0.446517 0.11348
C  3.393695 1.772467 -0.124626
C  4.642287 1.152663 -0.110124
C  -2.714606 1.148995 0.030585
C  -1.372697 3.199722 -0.060093
C  -3.893596 1.920596 0.009646
C  -2.556117 3.963383 -0.079895
C  -3.820682 3.335142 -0.0449
C  -5.234166 -0.621545 0.161867
C  -5.112725 -1.230246 1.432907
C  -5.148865 -1.396261 -1.018501
C  -4.894627 -2.625287 1.520785
C  -4.93135 -2.791177 -0.924016
C  -4.802967 -3.405603 0.343926
H  3.632116 -2.166522 0.142617
H  -1.124363 -0.998686 0.177168
H  3.297641 2.859055 -0.19769
H  5.572029 1.724606 -0.182143
H  -2.80375 0.060048 0.069764
H  -0.387721 3.672037 -0.087311
H  -2.500614 5.05632 -0.121688
H  -4.736861 3.935897 -0.05946
H  -5.190852 -0.618951 2.337651
H  -5.254272 -0.911958 -1.994582
H  -4.802233 -3.098781 2.504143
H  -4.86734 -3.39288 -1.836998
H  -4.638075 -4.486319 0.414752
