program: Gaussian 09
title: 000292399
version: EM64L-G09RevD.01
frameworkgroup: C1[X(C16H14Br2N2O)]
method: RPBEPBE
basis: SDD
operation: Freq
keyword: #p
keyword: freq=noraman
keyword: PBEPBE/SDD
title: #p freq=noraman PBEPBE/SDD
converged: YES YES NO NO
title: Mulliken charges:
elementType: Br Br O N N C C C C C C C C C C C C C C C C H H H H H H H H H H H H H H
charge: 0.020407 0.005680 -0.437156 -0.398306 -0.077466 0.351406 0.200282 0.284442 -0.004187 -0.043085 -0.329253 -0.457231 -0.374606 -0.275922 -0.360330 -0.262824 -0.213757 -0.277576 -0.297738 -0.234572 -0.233529 0.241693 0.234779 0.307973 0.216231 0.207029 0.233645 0.218172 0.222893 0.278432 0.254740 0.193282 0.222502 0.250454 0.333499
chargesum: 0.00000
title: Mulliken charges with hydrogens summed into heavy atoms:
elementType: Br Br O N N C C C C C C C C C C C C C C C C
charge: 0.020407 0.005680 -0.103657 -0.090333 -0.077466 0.351406 0.200282 0.284442 -0.004187 -0.043085 0.147218 -0.033971 -0.140961 -0.057750 -0.137437 0.015608 0.040984 -0.277576 0.118045 0.015882 -0.233529
polarizability: 4.14165889e+02 -6.97790396e+00 2.50964728e+02 -6.54409908e+00 -1.84854882e+01 9.79063781e+01
1716.lowfreq: -7.2931 -3.0879 -0.0006 -0.0005 0.0002 4.1282 4.5561 26.5196 33.4495
frequency: -0.9256 26.5073 33.4481 69.8248 80.2496 83.8237 86.9495 97.7354 125.0537 166.3679 181.8083 192.9526 222.6908 232.1656 263.5693 285.8974 286.9004 319.1791 338.8595 344.5676 354.5325 395.2642 439.5384 446.5867 469.8965 478.7920 518.4770 536.8888 547.4507 592.1599 606.0996 642.7797 674.1469 709.8976 717.9950 727.7944 771.1712 785.0086 811.6218 815.6763 837.4402 850.1658 865.2256 895.6859 913.4721 942.7679 946.4257 968.5069 980.6531 985.2333 1049.6946 1062.1144 1071.8922 1084.4287 1091.3880 1110.5215 1140.9093 1151.7096 1177.8428 1220.9647 1238.0525 1260.8269 1267.8592 1279.1196 1292.1354 1300.2047 1314.5151 1341.1039 1349.8301 1369.4153 1382.1201 1388.1608 1398.2640 1418.8679 1446.1575 1451.0769 1466.6953 1483.6987 1490.0396 1504.3771 1528.7991 1545.0344 1574.8862 1599.3003 1604.2207 2958.3608 2968.5272 2982.1960 3029.6314 3053.0769 3083.9540 3142.2164 3152.7916 3156.1891 3176.1191 3178.2983 3182.3658 3560.8160 3581.4275
redmass: 5.3471 10.6287 7.1723 2.6358 3.4369 5.5523 7.4051 4.9860 4.2018 36.8134 4.1109 6.2340 5.8914 2.3101 2.6377 6.9001 7.7224 1.4005 2.6637 4.3832 3.8552 1.9476 2.6601 4.2603 3.4863 4.9806 7.6785 3.4569 4.4770 4.6239 6.1905 7.3276 5.6660 6.1728 6.6626 3.8359 1.9824 1.2888 1.4263 5.5348 2.0010 1.8751 1.8186 1.5414 6.2675 1.8070 1.3728 1.3497 4.7366 6.5682 3.1478 1.9800 2.2411 2.1211 2.1857 2.3402 1.6529 1.3463 1.8970 1.2126 1.4516 2.0888 1.9143 1.3640 1.7351 1.3366 1.5964 1.7478 1.3883 2.8730 1.3364 4.1137 4.6255 5.7751 2.7889 2.8789 1.1436 1.0995 1.0762 2.6888 3.4094 6.6169 9.4567 6.7538 6.7119 1.0698 1.0655 1.0629 1.0993 1.0945 1.0966 1.0885 1.0912 1.0871 1.0959 1.0966 1.0931 1.0663 1.0767
irintensity: 0.4749 0.3767 1.6440 8.3055 3.7046 0.3262 0.6252 1.9179 0.6762 0.0883 0.3309 0.7391 0.0559 1.4792 10.9556 12.4138 6.8188 111.1692 60.8590 8.9237 13.1946 37.3407 37.7607 24.2180 3.1673 7.7016 0.6375 22.1698 3.6997 4.4851 0.8286 8.2196 0.4337 1.1903 101.9454 8.0936 10.8712 10.4227 64.8777 4.2661 11.6229 7.8275 11.7999 19.4517 61.0522 11.9686 0.1542 0.1327 147.4612 19.1317 1.4690 35.5391 2.0997 21.3008 16.4103 30.6827 1.8821 0.4447 3.4744 40.5384 21.5173 8.7898 22.6081 2.0666 9.8642 2.7811 30.8986 2.3833 21.9285 8.0289 8.6297 25.4477 33.1161 23.7403 93.4248 81.6043 56.1134 15.4507 48.7861 36.8759 412.3165 119.9591 206.9590 98.3669 18.0229 41.5005 13.3010 71.5285 18.9586 21.9281 47.8467 5.8133 8.9202 2.7451 1.4644 11.8300 0.2828 6.8162 45.0002
temp: 298.150 k
press: 1.00000 atm
elementType: 35 35 8 7 7 6 6 6 6 6 6 6 6 6 6 6 6 6 6 6 6 1 1 1 1 1 1 1 1 1 1 1 1 1 1
symmnumber: 1
zpe: 689815.2 jmol-1
zpe.correction: 0.262737 hartree
zpe.thermalcorrener: 0.281601 hartree
zpe.thermalcorrenthalpy: 0.282545 hartree
zpe.thermalcorrgfe: 0.213010 hartree
zpe.sumelectzpe: -828.278446 hartree
zpe.sumelectthermal: -828.259582 hartree
zpe.sumelectthermalent: -828.258637 hartree
zpe.sumelectthermalfe: -828.328173 hartree
dipole: 1.2431 0.4890 -1.1232
dipole: 1.7453
quadrupole: -165.3837 -113.4983 -147.4072
quadrupole: 2.2852 -6.7536 -8.1536
quadrupole: -23.2873 28.5981 -5.3108 2.2852 -6.7536 -8.1536
hfenergy: -828.5411826 hartree
pointgroup: C01 [X(C16H14Br2N2O1)]
dipole: -0.5086025 0.0382191 -0.4597277 debye
polarizability: 368.5167403|-71.6927094|296.1761264|27.1726918|-2.823458|98.3441287 unknown
InChI: InChI=1S/C16H14Br2N2O/c17-10-2-4-12-13-5-3-11(18)9-15(13)20-16(14(12)8-10)19-6-1-7-21/h2-5,8-9,19,21H,1,6-7H2
charge 0 multiplicity 1
35 atoms
Br -3.002603 4.484159 -0.321534
Br 5.426032 -2.620629 0.486518
O  -5.617477 -2.800437 1.089425
N  -1.958468 -1.012053 -0.518046
N  0.325376 -1.312911 -0.203911
C  0.772097 1.531631 -0.032069
C  -0.552932 1.002789 -0.216745
C  1.896541 0.603219 0.083097
C  -0.706821 -0.462225 -0.314495
C  1.605339 -0.805805 0.005535
C  -2.168957 -2.464571 -0.646311
C  -3.65775 -2.82062 -0.463393
C  0.927672 2.948129 0.044572
C  -1.665327 1.891339 -0.294451
C  3.248311 1.008451 0.274018
C  2.664634 -1.756534 0.127872
C  -0.166004 3.818712 -0.04767
C  -1.463268 3.272466 -0.213792
C  -4.165867 -2.595444 0.975223
C  4.288375 0.073897 0.392106
C  3.972561 -1.308556 0.317631
H  -1.537929 -2.966007 0.109068
H  -1.806114 -2.817769 -1.63338
H  -2.737727 -0.404601 -0.766588
H  -4.288541 -2.230242 -1.159249
H  -3.794877 -3.884436 -0.742652
H  1.922471 3.381115 0.181969
H  -2.68806 1.518197 -0.400723
H  3.504959 2.070735 0.33554
H  2.411047 -2.817012 0.0639
H  -0.024745 4.90123 0.013068
H  -3.610365 -3.248886 1.68207
H  -4.012204 -1.549428 1.287105
H  5.320779 0.401338 0.539196
H  -5.829156 -3.743042 0.870295
