program: Gaussian 09
title: 000292384
version: EM64L-G09RevD.01
frameworkgroup: C1[X(C12H15NO2S)]
method: RPBEPBE
basis: SDD
operation: Freq
keyword: #p
keyword: freq=noraman
keyword: PBEPBE/SDD
title: #p freq=noraman PBEPBE/SDD
converged: YES YES NO NO
title: Mulliken charges:
elementType: S O O N C C C C C C C C C C C C H H H H H H H H H H H H H H H
charge: -0.050165 -0.244485 -0.285273 -0.022105 -0.363266 -0.356424 -0.308678 -0.302462 -0.388892 0.300936 0.226078 -0.325776 -0.357755 -0.247113 -0.230272 -0.543461 0.246265 0.235570 0.229493 0.256357 0.218727 0.223190 0.208102 0.225123 0.260299 0.241760 0.231086 0.227476 0.244564 0.234263 0.216840
chargesum: 0.00000
title: Mulliken charges with hydrogens summed into heavy atoms:
elementType: S O O N C C C C C C C C C C C C
charge: -0.050165 -0.244485 -0.285273 -0.022105 0.118569 0.129426 0.133240 0.130763 -0.388892 0.300936 0.226078 -0.065477 -0.115996 -0.016028 -0.002796 0.152207
polarizability: 1.93810778e+02 -1.15774546e+00 1.67188694e+02 -1.24961354e+01 4.32407171e+00 1.22317645e+02
1716.lowfreq: -8.7844 -0.0025 -0.0019 -0.0011 7.4555 10.9162 34.9546 57.2938 76.5923
frequency: 34.7846 57.1076 76.4575 79.4307 98.1021 137.3309 167.2321 196.5280 227.2477 248.8840 266.8703 284.7827 322.7236 332.9999 395.0009 407.7972 440.9178 457.1680 486.3219 502.3599 546.3688 560.5363 602.8501 632.0829 658.8254 736.4394 754.1948 757.4652 793.5755 830.9212 841.6606 853.9310 892.7104 938.2902 974.1301 976.5109 983.2246 1009.9769 1016.7984 1042.7421 1045.9002 1069.7857 1107.8397 1111.4063 1112.6510 1149.8126 1164.8623 1173.3488 1189.0332 1205.9448 1222.6375 1243.8878 1265.3318 1271.3979 1281.4013 1324.3501 1339.4226 1348.5403 1363.8600 1373.3843 1420.2187 1435.1134 1447.0223 1448.5916 1450.5564 1459.4083 1465.8163 1467.8384 1473.3387 1484.2405 1582.1491 1599.9779 2963.3791 2966.7576 2978.7726 2985.8689 2989.4667 3054.6496 3060.9969 3086.7254 3090.4078 3107.9381 3123.9706 3133.5525 3146.8350 3160.1782 3172.2300
redmass: 5.8449 3.7117 4.9804 4.2177 3.3165 4.4272 3.7610 2.7797 4.4582 1.3615 3.0042 3.3590 3.6539 3.2921 4.3972 2.1207 3.7249 3.0808 3.5484 5.5256 4.3097 4.5171 2.4768 6.8678 4.0280 3.7890 1.5848 3.1438 4.3788 1.6784 2.2907 1.9765 2.6380 1.3946 2.3082 1.8703 8.1375 2.6206 2.4702 2.1807 2.2789 3.2791 2.1762 1.5210 1.5947 1.5993 2.0811 1.1181 1.0839 2.1051 2.3024 1.5924 1.8276 1.2358 1.6607 1.2442 1.2422 1.3579 1.2681 9.7330 1.8532 1.4834 1.5492 1.0868 1.0828 1.1074 1.4358 1.0931 1.3886 1.7093 6.9064 6.4223 1.0328 1.0672 1.0681 1.0608 1.0630 1.1037 1.1009 1.0999 1.0997 1.0943 1.1000 1.0855 1.0898 1.0939 1.1004
irintensity: 1.0785 0.2338 2.0938 3.3984 3.3594 1.6322 2.2922 3.2432 1.8231 1.3098 0.7025 11.1794 4.6251 5.0844 3.5868 0.5788 1.0504 0.5186 7.6716 16.6115 0.0157 1.7920 10.3398 2.2009 5.8029 4.3558 69.8245 31.6807 16.4943 0.0217 6.4906 2.8275 0.0539 3.9212 30.3698 19.6131 29.4894 15.7296 55.2315 9.9356 36.6398 24.4349 6.6395 14.1859 13.6628 1.5072 3.3987 5.2254 7.5510 42.9035 172.8119 23.8928 53.5892 11.4323 50.6640 2.2018 0.8954 3.5928 0.7663 2.9007 18.4555 76.1166 83.6934 10.2542 4.6684 4.8527 65.7047 26.9965 58.9342 16.2278 10.2470 26.7354 62.3949 44.0017 25.7391 14.0912 92.4757 37.2260 16.2390 31.4942 39.1727 8.9249 18.7889 0.8730 8.2520 18.9427 18.8838
temp: 298.150 k
press: 1.00000 atm
elementType: 16 8 8 7 6 6 6 6 6 6 6 6 6 6 6 6 1 1 1 1 1 1 1 1 1 1 1 1 1 1 1
symmnumber: 1
zpe: 656415.4 jmol-1
zpe.correction: 0.250015 hartree
zpe.thermalcorrener: 0.265057 hartree
zpe.thermalcorrenthalpy: 0.266001 hartree
zpe.thermalcorrgfe: 0.207209 hartree
zpe.sumelectzpe: -1068.307357 hartree
zpe.sumelectthermal: -1068.292316 hartree
zpe.sumelectthermalent: -1068.291371 hartree
zpe.sumelectthermalfe: -1068.350164 hartree
dipole: 1.2594 -4.2580 -1.5010
dipole: 4.6872
quadrupole: -97.8432 -100.8111 -101.4291
quadrupole: -9.4269 -3.6129 -10.8840
quadrupole: 2.1846 -0.7833 -1.4013 -9.4269 -3.6129 -10.8840
hfenergy: -1068.5573726 hartree
pointgroup: C01[X(C12H15N1O2S1)]
dipole: 0.5659375 -0.4748913 -1.6896335 debye
polarizability: 190.363128|16.6795895|138.1084869|-11.0918452|19.196178|154.845502 unknown
InChI: InChI=1S/C12H15NO2S/c1-14-11-5-3-2-4-10(11)12(16)13-6-8-15-9-7-13/h2-5H,6-9H2,1H3
charge 0 multiplicity 1
31 atoms
S  -0.382834 0.492637 2.882928
O  -3.580808 -0.653327 -1.22049
O  0.734073 -1.569788 -0.426823
N  -1.457288 0.504607 0.364953
C  -1.458279 0.634494 -1.113358
C  -2.823922 0.369066 0.922136
C  -2.208484 -0.557518 -1.743484
C  -3.54641 -0.811316 0.245555
C  -0.33796 0.533664 1.159011
C  1.005714 0.632753 0.490751
C  1.565319 -0.446132 -0.258536
C  1.80016 1.785939 0.699037
C  2.879634 -0.359874 -0.778275
C  3.10278 1.889938 0.164662
C  3.64162 0.811491 -0.570321
C  1.330341 -2.776562 -1.008541
H  -0.425892 0.68775 -1.488303
H  -1.981081 1.575891 -1.378668
H  -3.378866 1.309114 0.732439
H  -2.735935 0.219515 2.012491
H  -2.316467 -0.418936 -2.83187
H  -1.650752 -1.49234 -1.532193
H  -3.039017 -1.762942 0.510823
H  -4.601098 -0.853804 0.56222
H  1.384712 2.593931 1.309993
H  3.313955 -1.193171 -1.338312
H  3.694123 2.794881 0.336391
H  4.657168 0.87233 -0.976882
H  0.538539 -3.538685 -0.960536
H  2.205614 -3.110475 -0.41988
H  1.628842 -2.615532 -2.062817
