program: Gaussian 09
title: 000292383
version: EM64L-G09RevD.01
frameworkgroup: C1[X(C12H13N3O3)]
method: RPBEPBE
basis: SDD
operation: Freq
keyword: #p
keyword: freq=noraman
keyword: PBEPBE/SDD
title: #p freq=noraman PBEPBE/SDD
converged: YES YES NO NO
title: Mulliken charges:
elementType: O O O N N N C C C C C C C C C C C C H H H H H H H H H H H H H
charge: -0.248671 -0.214707 -0.220699 -0.133955 -0.273772 0.019945 0.437547 -0.387867 0.436287 0.194771 -0.528600 -0.774019 -0.660977 -0.336803 -0.316597 -0.365717 -0.370115 0.389054 0.241167 0.261217 0.282021 0.250007 0.237574 0.254692 0.226659 0.240649 0.228527 0.303145 0.254912 0.287876 0.286450
chargesum: 0.00000
title: Mulliken charges with hydrogens summed into heavy atoms:
elementType: O O O N N N C C C C C C C C C C C C
charge: -0.248671 -0.214707 -0.220699 -0.133955 -0.273772 0.019945 0.437547 0.114517 0.436287 0.194771 -0.246579 -0.031746 0.034857 -0.033658 -0.061685 -0.077841 -0.083665 0.389054
polarizability: 2.91134535e+02 8.66657254e+00 1.78592692e+02 4.95082659e+00 -1.11393603e+01 8.79110020e+01
1716.lowfreq: -6.9201 -3.1145 -0.0001 0.0002 0.0005 7.2293 44.0390 49.3538 65.8676
frequency: 44.0017 49.3225 65.8413 85.7853 98.2720 137.8930 150.0548 167.4014 183.8390 205.1797 223.3108 232.1877 275.9304 295.6450 312.3661 353.5199 354.8146 400.2494 418.6889 475.9519 497.6309 509.0250 567.1854 596.4673 602.6344 625.8614 642.5425 664.6178 687.5464 701.6481 730.7062 770.1130 788.7959 802.4658 827.6847 833.6838 856.4348 956.0213 979.4004 987.1668 988.8700 993.1556 1003.5950 1040.2058 1050.0118 1086.1990 1096.5939 1116.0491 1120.9603 1160.9855 1178.4558 1181.4238 1199.1281 1224.9374 1290.4345 1298.7849 1330.4051 1338.7213 1355.3772 1390.8512 1399.1245 1404.2316 1413.1089 1433.4815 1460.1046 1464.9488 1478.7027 1484.1772 1487.9019 1493.0255 1583.2870 1596.1655 1606.4190 1653.0926 2983.2313 2985.4884 3001.6868 3062.6571 3080.4548 3095.0968 3110.2307 3114.1053 3168.5397 3180.6199 3187.2171 3203.9144 3248.1803
redmass: 5.2187 8.1204 5.3166 4.8899 4.0671 2.8123 4.0162 1.3245 2.3691 2.0166 3.1719 3.1807 2.5084 4.4798 4.3785 4.8887 3.5711 5.8373 3.1376 5.1517 3.9250 6.7085 4.9901 5.4373 3.9300 6.6066 4.4023 4.7899 3.9659 5.8780 5.0709 1.5900 4.8102 1.4341 2.6514 1.2734 1.7083 4.2810 1.3250 1.3589 2.6014 1.6275 2.5514 2.3232 1.7098 2.2215 3.0395 1.9950 1.7007 1.9056 2.3476 2.2063 2.0779 4.4938 1.2343 1.3005 3.8208 1.7430 7.9650 2.5717 1.3403 1.6947 2.0268 4.1590 1.0681 1.0550 1.1029 1.1921 1.9792 1.1305 7.9980 6.6808 6.2972 10.6658 1.0462 1.0620 1.0367 1.0969 1.0949 1.0987 1.0993 1.0980 1.0879 1.0904 1.0963 1.0964 1.0991
irintensity: 0.5587 1.0376 3.2013 1.9573 0.6906 0.7598 3.3592 0.2564 0.1702 3.9230 2.6799 0.7566 1.5081 0.1186 2.2805 5.5655 3.7027 3.7408 5.0125 16.6907 4.4015 1.5564 7.1749 1.5908 6.4927 2.7608 12.7825 20.0243 1.2854 35.9800 5.3422 0.4124 16.7922 56.5316 6.3093 7.1378 59.1984 66.5836 6.9513 3.1611 8.3062 1.1432 3.7564 43.6260 17.1507 6.9806 20.2079 104.9743 42.6092 4.8234 243.2015 29.6525 8.7763 473.7760 12.8017 3.3197 179.5289 123.7266 99.2769 21.6424 45.6083 24.3934 41.7190 29.9803 3.1447 18.5249 4.1199 26.3318 76.5577 18.7640 8.3609 15.6208 226.5416 382.3453 35.8549 19.2131 19.4118 11.5203 0.0564 29.5094 37.0351 6.7213 2.0877 1.2600 3.2955 1.4461 0.5003
temp: 298.150 k
press: 1.00000 atm
elementType: 8 8 8 7 7 7 6 6 6 6 6 6 6 6 6 6 6 6 1 1 1 1 1 1 1 1 1 1 1 1 1
symmnumber: 1
zpe: 621951.8 jmol-1
zpe.correction: 0.236889 hartree
zpe.thermalcorrener: 0.253394 hartree
zpe.thermalcorrenthalpy: 0.254338 hartree
zpe.thermalcorrgfe: 0.192492 hartree
zpe.sumelectzpe: -853.593011 hartree
zpe.sumelectthermal: -853.576506 hartree
zpe.sumelectthermalent: -853.575562 hartree
zpe.sumelectthermalfe: -853.637409 hartree
dipole: -9.0368 4.7770 1.2015
dipole: 10.2921
quadrupole: -119.9121 -111.3077 -104.2486
quadrupole: -12.9515 0.7574 -0.2912
quadrupole: -8.0893 0.5151 7.5742 -12.9515 0.7574 -0.2912
hfenergy: -853.8299002 hartree
pointgroup: C01 [X(C12H13N3O3)]
dipole: -3.5021798 -1.9802626 -0.4576974 debye
polarizability: 291.423061|-5.2967035|178.4404838|-7.0028878|-10.0853756|87.7746845 unknown
InChI: InChI=1S/C12H13N3O3/c1-3-13-9(2)8-12(16)14(13)10-4-6-11(7-5-10)15(17)18/h4-8H,3H2,1-2H3
charge 0 multiplicity 1
31 atoms
O  -1.448745 2.898584 0.201059
O  5.078463 0.728356 -0.371087
O  4.781348 -1.362565 0.498058
N  -2.23508 -0.584706 0.003019
N  -1.318506 0.513284 -0.127874
N  4.325896 -0.236332 0.049147
C  -3.490502 -0.017082 0.306076
C  -2.091291 -1.71726 -0.971031
C  0.079702 0.311614 -0.071682
C  -2.013774 1.769505 0.17696
C  -3.379329 1.353271 0.453772
C  -4.724134 -0.867364 0.404611
C  -2.278256 -3.099277 -0.320455
C  0.943674 1.345715 -0.537618
C  0.632634 -0.89127 0.455343
C  2.334637 1.166832 -0.489191
C  2.023469 -1.073095 0.493303
C  2.864482 -0.043886 0.013976
H  -2.805951 -1.577462 -1.806512
H  -1.078461 -1.645225 -1.39833
H  -4.170622 2.041867 0.736547
H  -4.643112 -1.606448 1.222021
H  -4.924656 -1.422383 -0.531326
H  -5.595484 -0.225776 0.607509
H  -1.571275 -3.247443 0.513792
H  -3.298968 -3.243631 0.069099
H  -2.089902 -3.885359 -1.073721
H  0.512146 2.275371 -0.911538
H  -0.028882 -1.655247 0.87138
H  3.017251 1.943996 -0.842056
H  2.470226 -1.983785 0.900452
