program: Gaussian 09
title: 000292358
version: EM64L-G09RevD.01
frameworkgroup: C1[X(C8H9ClN2O2)]
method: RPBEPBE
basis: SDD
operation: Freq
keyword: #p
keyword: freq=noraman
keyword: PBEPBE/SDD
title: #p freq=noraman PBEPBE/SDD
converged: YES YES NO NO
title: Mulliken charges:
elementType: Cl O O N N C C C C C C C C H H H H H H H H H
charge: -0.058425 -0.285743 -0.259478 -0.417050 -0.534689 0.289812 0.602870 -0.540633 -0.373662 -0.339277 -0.198420 0.170705 -0.500999 0.277806 0.274673 0.253200 0.321500 0.299912 0.300280 0.232704 0.242346 0.242567
chargesum: 0.00000
title: Mulliken charges with hydrogens summed into heavy atoms:
elementType: Cl O O N N C C C C C C C C
charge: -0.058425 -0.285743 -0.259478 -0.095550 0.065503 0.289812 0.602870 -0.262827 -0.098989 -0.339277 0.054780 0.170705 0.216618
polarizability: 1.82450425e+02 9.67674506e-02 1.33133966e+02 -1.43341521e-02 -6.05023213e-02 5.54469343e+01
1716.lowfreq: -6.4108 0.0007 0.0015 0.0021 7.5088 8.9498 43.9784 65.8329 78.3106
frequency: 43.8249 65.8131 78.2794 97.2795 113.1964 145.7925 180.6719 207.3583 243.0969 278.9037 299.4214 308.9081 313.5905 432.0567 442.2439 482.9496 505.6752 551.0351 563.2478 593.7763 621.0775 689.7937 708.2795 737.9666 753.3275 822.4158 866.6010 914.8685 952.3343 974.5921 1008.4616 1082.6653 1113.8664 1131.7059 1147.6794 1167.6050 1219.6820 1251.7195 1262.9076 1311.0167 1382.9751 1421.5879 1436.0160 1446.8404 1450.5012 1463.5944 1490.2868 1578.8900 1608.1872 1624.7814 1666.3363 3003.7013 3104.7405 3147.7885 3160.4643 3162.8003 3193.0167 3416.5929 3543.6025 3558.8920
redmass: 3.0704 2.4239 1.8966 4.2201 4.6853 4.1920 6.2190 3.4131 5.9010 10.5612 6.0685 1.1855 4.5719 4.8048 3.2973 8.4541 5.8129 2.2969 1.3980 1.5005 6.3683 6.8276 4.9423 3.0942 6.2003 1.4374 6.8387 1.5475 1.3551 5.1153 7.1462 2.3251 1.2636 1.8607 1.4787 2.5511 2.3833 1.1708 1.7626 2.5016 3.9561 1.3136 4.2418 2.0919 1.0501 1.0531 2.1268 5.7061 7.0410 8.7847 1.0914 1.0296 1.1044 1.1047 1.0904 1.0901 1.0958 1.0405 1.1039 1.0781
irintensity: 2.3486 0.2879 1.5477 3.6420 0.7734 3.2102 0.5341 5.9155 12.2685 1.0127 0.4544 0.1737 14.2783 12.2109 2.5962 4.4771 16.9280 67.5258 282.5948 123.4380 19.4772 2.5225 4.2805 25.8604 7.2027 25.0307 15.0552 24.4828 0.7729 49.0654 91.2000 116.0984 0.0386 3.6841 51.2763 57.1463 210.7319 0.1325 48.0124 56.4572 67.5566 13.1319 137.3237 24.4083 14.3033 9.9949 64.8512 39.1514 190.8817 104.4640 20.7632 42.0919 27.2330 16.1644 2.0697 2.8782 0.8283 3.0979 1.1672 60.9627
temp: 298.150 k
press: 1.00000 atm
elementType: 17 8 8 7 7 6 6 6 6 6 6 6 6 1 1 1 1 1 1 1 1 1
symmnumber: 1
zpe: 427947.8 jmol-1
zpe.correction: 0.162997 hartree
zpe.thermalcorrener: 0.176307 hartree
zpe.thermalcorrenthalpy: 0.177251 hartree
zpe.thermalcorrgfe: 0.122169 hartree
zpe.sumelectzpe: -1029.275972 hartree
zpe.sumelectthermal: -1029.262661 hartree
zpe.sumelectthermalent: -1029.261717 hartree
zpe.sumelectthermalfe: -1029.316800 hartree
dipole: -1.1890 -0.2670 0.0192
dipole: 1.2188
quadrupole: -75.7565 -78.9482 -83.3022
quadrupole: 6.6650 -0.0154 0.0092
quadrupole: 3.5791 0.3874 -3.9666 6.6650 -0.0154 0.0092
hfenergy: -1029.4389687 hartree
pointgroup: C01 [X(C8H9Cl1N2O2)]
dipole: -0.4758793 0.0575954 0.0119282 debye
dipolederiv: -0.7932168 -0.2792732 0.0192483 -0.2481276 -0.24031 0.0038931 0.0207251 0.0051355 -0.0610208 -1.597132 0.182636 0.0522855 0.5354383 -0.5751836 -0.0267824 0.0597197 -0.0141158 -0.295648 -0.8042096 -0.2104174 0.0120099 -0.13617 -0.9399227 -0.0110004 0.0132343 -0.0087769 -0.3252109 -0.645304 0.6785458 0.024006 0.4205425 -0.3190672 -0.008935 0.0081941 -0.0135822 -0.4627841 -0.6658331 0.3935707 0.0418064 0.1347545 -0.0222952 -0.0059027 0.0357508 -0.0198147 0.0101404 -0.6000661 -0.3386818 0.0129159 -0.1725346 0.1404134 0.0104131 0.0181087 0.0162202 0.0156235 0.5458889 -1.0004521 -0.0429819 -0.8166277 0.2347979 0.0304761 -0.0376865 0.0389902 0.1562902 -0.0957186 0.5159546 0.0108158 -0.2578233 -0.1208601 0.0119201 -0.0116897 -0.0172017 -0.2120001 -0.0994267 -0.0420355 -0.004135 0.1623949 -0.1791759 -0.0062164 0.001537 0.0013995 -0.1817628 0.9531661 0.4282278 -0.0274095 0.7314918 0.1034647 -0.0206413 -0.0184556 -0.0101649 -0.1206574 -0.1347507 0.0094801 0.0029597 -0.0977465 0.0596742 0.0071356 -0.000437 0.0038046 -0.0700476 2.1479825 0.1411678 -0.0657487 -0.2129887 1.2433846 0.0338123 -0.0743965 0.0217656 0.2355677 0.7912131 -0.0178946 -0.0196527 0.0553272 0.2223175 -0.0038824 -0.0160147 -0.0016343 0.2825172 0.1347307 -0.0311008 0.0002544 -0.0008484 0.0067258 -0.0045797 0.0010526 -0.0033628 0.1695216 0.0443222 0.0608736 0.0064675 0.0639825 0.0555357 -0.0057279 0.0064413 -0.0054621 0.1717791 0.0845805 -0.0400876 0.0015896 -0.0381383 -0.0454604 -0.0045113 0.0015243 -0.0043838 0.1577148 0.2423482 -0.0465897 0.0031586 -0.0144569 0.0968932 -0.0073292 0.0078117 -0.0081239 0.3378362 0.2784622 -0.2348763 -0.1551344 -0.0207699 0.1125286 0.0183511 -0.0979193 0.0143557 0.1023563 0.2990564 -0.2463393 0.121665 -0.0300139 0.1157352 -0.0140973 0.0801323 0.0059032 0.0831208 -0.0250392 0.0661614 0.00646 0.1384823 -0.0419109 -0.007712 0.0079225 -0.005305 0.1208911 -0.0296496 0.0082783 -0.0038304 -0.0955093 0.0425855 0.1074364 0.0491108 0.0829112 -0.0555974 -0.0314043 0.0028523 0.0032499 -0.1006587 0.0501297 -0.0961198 -0.0546659 -0.0785575 -0.0586297 unknown
polarizability: 181.8059562|4.9279337|133.5479304|-4.5437171|2.1103506|55.677439 unknown
InChI: InChI=1S/C8H9ClN2O2/c1-13-8(12)5-2-3-6(9)7(4-5)11-10/h2-4,11H,10H2,1H3
charge 0 multiplicity 1
22 atoms
Cl 3.634385 1.754706 -0.128911
O  -3.061289 0.544967 0.08114
O  -2.341441 -1.668385 -0.003335
N  2.813652 -1.175892 -0.183184
N  2.701428 -2.572802 -0.231424
C  -0.698254 0.141413 -0.014543
C  1.726976 -0.30169 -0.117071
C  0.385037 -0.766077 -0.080612
C  -0.473072 1.541022 0.017392
C  1.919407 1.111695 -0.083087
C  0.853949 2.021208 -0.017503
C  -2.070873 -0.441115 0.019419
C  -4.453647 0.043168 0.118363
H  0.17104 -1.838799 -0.103112
H  -1.318128 2.230397 0.068065
H  1.061555 3.094979 0.005763
H  3.759662 -0.796034 -0.213076
H  2.267597 -2.931367 -1.089708
H  2.341156 -2.996485 0.63101
H  -5.077076 0.947377 0.157024
H  -4.609749 -0.586633 1.010469
H  -4.670315 -0.552256 -0.78458
