program: Gaussian 09
title: 000292374
version: EM64L-G09RevD.01
frameworkgroup: C1[X(C11H13N3O)]
method: RPBEPBE
basis: SDD
operation: Freq
keyword: #p
keyword: freq=noraman
keyword: PBEPBE/SDD
title: #p freq=noraman PBEPBE/SDD
converged: YES YES NO NO
title: Mulliken charges:
elementType: O N N N C C C C C C C C C C C H H H H H H H H H H H H H
charge: -0.269035 -0.279803 -0.128899 -0.699145 0.435893 0.454939 0.166635 -0.532615 -0.655820 -0.779973 -0.359966 -0.361949 -0.410963 -0.411508 0.507334 0.273352 0.241147 0.270939 0.239846 0.239408 0.239752 0.251622 0.274717 0.250984 0.218352 0.216378 0.302841 0.305539
chargesum: 0.00000
title: Mulliken charges with hydrogens summed into heavy atoms:
elementType: O N N N C C C C C C C C C C C
charge: -0.269035 -0.279803 -0.128899 -0.090766 0.435893 0.454939 0.166635 -0.259263 0.096111 -0.049192 -0.085249 -0.110965 -0.192611 -0.195130 0.507334
polarizability: 2.25573519e+02 2.87297497e+00 1.44494805e+02 -3.59444587e+00 9.00628240e+00 8.44009371e+01
1716.lowfreq: -4.6191 -0.0008 -0.0008 -0.0007 6.5543 8.6009 51.6695 62.4967 80.2029
frequency: 51.6279 62.4662 80.2008 136.4113 151.2286 171.8745 174.2850 198.7233 247.8296 272.8506 293.4280 333.2917 344.4729 357.4806 361.2934 387.0931 412.2061 433.0135 510.6482 560.5867 580.2953 594.9497 603.0947 636.9074 667.1312 691.4928 715.4927 796.2476 808.8074 811.8377 824.3288 838.4817 933.8186 946.9553 974.8004 987.8378 1006.8325 1016.2988 1035.9353 1047.0732 1091.8075 1130.5785 1133.1695 1166.8007 1186.4081 1210.6089 1213.1342 1298.9790 1311.9840 1343.6701 1378.0673 1391.4043 1405.0084 1436.2455 1443.0203 1458.0719 1470.0528 1478.9372 1496.4157 1516.6627 1579.3049 1591.9664 1632.9490 1639.9912 1646.2227 2967.7254 2979.4197 3056.7805 3078.8599 3106.8835 3118.2248 3120.5585 3126.8709 3147.8674 3184.2575 3242.7952 3568.6125 3708.8634
redmass: 3.9794 4.4370 4.2670 2.4412 1.2194 2.5408 1.8075 2.1113 5.3276 3.4384 2.9759 1.3014 3.8629 1.1995 2.9730 3.7886 2.8268 4.6004 2.6351 4.2889 5.2858 4.3638 5.6242 6.3460 4.5572 3.7986 3.7063 1.4403 1.2726 3.4751 2.2212 3.7306 1.3406 1.3452 5.1775 1.6852 2.3200 1.5283 2.2416 1.5918 2.1115 1.2547 1.6837 1.6643 1.1516 4.5014 2.7021 2.4149 1.3713 6.6030 3.9577 3.0440 1.4123 1.3956 2.5365 1.0579 1.0562 1.1366 1.1061 3.1302 7.1309 6.8494 2.0659 6.4369 2.0952 1.0435 1.0394 1.0970 1.0898 1.0973 1.0882 1.1008 1.0900 1.0956 1.0949 1.0989 1.0448 1.1040
irintensity: 5.8262 0.0630 2.9151 4.3017 1.4586 1.7121 1.6444 1.2501 0.4930 11.0843 1.5236 262.2797 44.4828 1.0363 29.1616 4.3793 0.2613 6.0641 19.0897 6.0057 11.9083 18.5807 11.7216 1.1921 5.0785 2.7651 0.2401 46.9580 0.5652 30.7263 58.2461 11.2244 0.2729 2.0056 7.0650 0.9920 5.4091 2.2163 15.6017 9.6328 10.0877 14.3872 57.2640 22.4307 16.3723 5.7991 4.0497 151.9055 6.4750 27.7484 23.3338 33.5472 22.9446 17.4974 8.5393 31.4600 13.0889 8.5976 11.5182 292.4590 4.3678 3.2496 41.2015 352.0538 251.8163 63.1413 32.5934 17.6005 15.1497 15.0478 22.9827 8.5822 29.2568 9.2531 0.6651 1.0681 86.6122 20.2648
temp: 298.150 k
press: 1.00000 atm
elementType: 8 7 7 7 6 6 6 6 6 6 6 6 6 6 6 1 1 1 1 1 1 1 1 1 1 1 1 1
symmnumber: 1
zpe: 586880.8 jmol-1
zpe.correction: 0.223531 hartree
zpe.thermalcorrener: 0.237882 hartree
zpe.thermalcorrenthalpy: 0.238826 hartree
zpe.thermalcorrgfe: 0.182808 hartree
zpe.sumelectzpe: -665.340324 hartree
zpe.sumelectthermal: -665.325973 hartree
zpe.sumelectthermalent: -665.325029 hartree
zpe.sumelectthermalfe: -665.381048 hartree
dipole: -0.9386 -6.0680 1.0053
dipole: 6.2219
quadrupole: -53.8354 -94.2305 -89.4818
quadrupole: -6.3634 1.4751 4.3481
quadrupole: 25.3471 -15.0479 -10.2993 -6.3634 1.4751 4.3481
hfenergy: -665.5638553 hartree
pointgroup: C01 [X(C11H13N3O1)]
dipole: 0.4243426 -2.347785 -0.5476431 debye
polarizability: 225.5495579|-0.60655|145.2939147|-5.3307322|-5.3144703|83.6257885 unknown
InChI: InChI=1S/C11H13N3O/c1-8-7-11(15)14(13(8)2)10-5-3-9(12)4-6-10/h3-7H,12H2,1-2H3
charge 0 multiplicity 1
28 atoms
O  -1.023056 2.58674 0.437029
N  -0.83671 0.256076 -0.102379
N  -1.718478 -0.872681 -0.074215
N  4.805975 -0.363301 0.109151
C  -2.999853 -0.376458 0.236445
C  0.579917 0.073899 -0.051346
C  -1.558972 1.4473 0.294299
C  -2.930616 0.981095 0.492624
C  -1.512395 -1.906739 -1.1104
C  -4.192977 -1.290539 0.242028
C  1.424082 1.054974 -0.629969
C  1.16118 -1.044318 0.599061
C  2.821201 0.914291 -0.564954
C  2.559514 -1.198925 0.64167
C  3.416671 -0.219275 0.061894
H  -3.742364 1.623662 0.823286
H  -2.171484 -2.760799 -0.887972
H  -0.468324 -2.254418 -1.084105
H  -1.735859 -1.521856 -2.1256
H  -4.012799 -2.190725 0.857944
H  -4.466382 -1.626739 -0.77655
H  -5.061745 -0.758059 0.660147
H  0.976702 1.933045 -1.10187
H  0.514698 -1.776861 1.095309
H  3.460899 1.688651 -1.005464
H  2.992761 -2.071676 1.145678
H  5.232334 -1.154252 0.581967
H  5.415179 0.353389 -0.273308
