program: Gaussian 09
title: 000292396
version: EM64L-G09RevD.01
frameworkgroup: C1[X(C14H9FN4O5S)]
method: RPBEPBE
basis: SDD
operation: Freq
keyword: #p
keyword: freq=noraman
keyword: PBEPBE/SDD
title: #p freq=noraman PBEPBE/SDD
converged: YES YES NO NO
title: Mulliken charges:
elementType: S F O O O O O N N N N C C C C C C C C C C C C C C H H H H H H H H H
charge: 1.085481 -0.339390 -0.127227 -0.471236 -0.470244 -0.205075 -0.201277 -0.245685 -0.053147 0.004854 0.031684 0.131488 -0.663089 0.364245 0.186179 -0.328198 0.180614 -0.108731 -0.345763 -0.226142 -0.212936 -0.277660 -0.250483 0.363885 -0.412462 0.292713 0.291188 0.314119 0.252580 0.295814 0.255085 0.289329 0.298558 0.300933
chargesum: 0.00000
title: Mulliken charges with hydrogens summed into heavy atoms:
elementType: S F O O O O O N N N N C C C C C C C C C C C C C C
charge: 1.085481 -0.339390 -0.127227 -0.471236 -0.470244 -0.205075 -0.201277 -0.245685 -0.053147 0.004854 0.031684 0.131488 -0.079188 0.364245 0.186179 -0.014079 0.180614 -0.108731 -0.093183 0.069672 0.042149 0.011668 0.048075 0.363885 -0.111530
polarizability: 4.36078682e+02 3.64654447e+01 2.70759800e+02 -4.89453819e+00 5.13814222e+00 9.90841575e+01
1716.lowfreq: -2.9284 -0.0014 -0.0007 0.0006 1.4295 3.5243 12.4751 15.9701 25.5972
frequency: 12.3725 15.9405 25.5667 33.8464 45.8459 60.0906 80.7030 93.2287 98.8866 135.4686 150.6133 179.0052 196.5986 214.5030 219.7249 225.9295 240.8880 278.1110 289.6183 315.0876 340.6434 353.9799 383.1363 410.9542 413.5269 432.7041 438.5478 456.0702 502.3643 503.9937 506.3884 546.3353 576.2271 587.8485 601.3079 617.9698 631.8210 667.8683 675.9596 685.2752 700.6654 752.7567 768.2552 792.0843 802.6596 853.8247 866.1309 871.8694 920.6181 928.4195 942.1749 946.2727 950.7032 975.6286 978.8553 994.3648 998.4445 1006.8923 1026.6808 1051.5492 1069.8055 1088.9644 1099.2316 1122.7139 1124.2356 1139.1811 1184.4458 1213.9528 1221.4126 1277.0942 1288.2801 1311.2057 1339.1667 1357.7360 1365.9406 1384.3855 1395.0074 1407.3246 1428.8485 1447.1257 1480.6317 1527.6123 1557.5258 1564.9597 1577.0112 1610.1696 1691.6000 3017.4873 3072.5199 3147.5714 3162.9946 3163.9603 3173.2698 3179.2656 3182.1491 3206.9796
redmass: 6.1523 14.0527 9.2323 12.3907 9.8572 8.4483 5.5504 10.8692 8.1563 3.7827 10.0027 5.9880 8.5289 8.7181 6.8502 10.9451 9.2729 6.9786 9.8075 12.2718 8.6657 5.0209 9.1752 6.7852 3.8251 9.0004 3.6229 2.8181 3.7433 6.7490 7.4505 8.6411 6.2300 4.9610 4.8905 7.8273 7.5156 9.3859 6.6866 2.2518 9.1787 9.3208 5.4732 9.5631 1.4009 16.0303 1.4684 7.2749 1.7010 1.3430 5.9372 2.0837 1.4572 5.6443 3.8381 11.6211 1.4089 1.3317 6.3291 4.9812 1.9418 2.0473 2.3678 3.3831 1.1787 1.5452 1.1021 9.2266 1.5751 1.4965 1.3254 3.7941 4.9760 5.8173 4.5429 6.9919 3.5802 1.2467 2.4714 2.8843 3.8750 7.1294 7.2845 6.9548 6.8723 6.7314 12.7505 1.0615 1.1000 1.0885 1.0918 1.0926 1.0931 1.0996 1.0913 1.0965
irintensity: 1.4989 0.2237 1.7553 0.9137 0.7509 0.5403 0.0317 1.1402 0.5988 16.7008 2.4072 1.0425 6.2330 2.0746 2.1419 3.2154 4.5451 0.3424 13.0702 4.4730 3.2434 0.1343 4.7570 4.8433 4.5256 61.3541 20.2360 11.2273 9.6266 2.0143 27.8066 90.1512 49.1655 5.5396 2.8120 1.8918 18.9136 10.5724 12.4397 27.8829 5.6823 36.2491 5.3002 18.8212 50.0837 60.4017 40.7069 86.1521 9.8511 6.1543 23.4780 0.7049 11.8812 3.6306 7.4822 70.9368 2.0873 0.5374 83.3002 38.9732 54.2784 28.7164 15.3211 60.8829 2.5504 73.4652 3.0108 758.5887 3.4831 43.0469 4.8758 126.4485 46.6815 13.5484 177.0983 18.9292 135.3040 12.5269 22.8575 304.4906 1.1413 8.1998 60.8856 20.4056 331.9470 13.2200 323.6187 1.1218 0.0051 8.5699 6.2995 7.8285 0.9248 7.7548 1.8793 0.5088
temp: 298.150 k
press: 1.00000 atm
elementType: 16 9 8 8 8 8 8 7 7 7 7 6 6 6 6 6 6 6 6 6 6 6 6 6 6 1 1 1 1 1 1 1 1 1
symmnumber: 1
zpe: 573941.7 jmol-1
zpe.correction: 0.218603 hartree
zpe.thermalcorrener: 0.240696 hartree
zpe.thermalcorrenthalpy: 0.241641 hartree
zpe.thermalcorrgfe: 0.162779 hartree
zpe.sumelectzpe: -1629.879870 hartree
zpe.sumelectthermal: -1629.857776 hartree
zpe.sumelectthermalent: -1629.856832 hartree
zpe.sumelectthermalfe: -1629.935694 hartree
dipole: 5.7030 7.1319 -0.7451
dipole: 9.1620
quadrupole: -201.5369 -161.0489 -152.6152
quadrupole: 27.0640 -2.3860 0.0423
quadrupole: -29.8032 10.6848 19.1184 27.0640 -2.3860 0.0423
hfenergy: -1630.0984727 hartree
pointgroup: C01 [X(C14H9F1N4O5S1)]
dipole: -2.3669119 2.704401 0.2779476 debye
polarizability: 439.0123647|-28.9932928|267.8307566|-3.3017288|-5.8472967|99.0795189 unknown
InChI: InChI=1S/C14H9FN4O5S/c15-25(23,24)11-3-1-2-9(6-11)12-7-14(20)18(17-12)13-5-4-10(8-16-13)19(21)22/h1-6,8H,7H2
charge 0 multiplicity 1
34 atoms
S  -4.662416 -2.318452 0.100809
F  -4.760717 -2.567394 -1.734876
O  1.934193 3.604825 -0.071085
O  -3.436319 -3.222439 0.609528
O  -6.15984 -2.49298 0.654754
O  5.851164 -3.026254 0.099584
O  7.024845 -1.069461 -0.038621
N  1.177664 1.300354 -0.018685
N  -0.072923 0.637602 0.012797
N  3.533533 1.164878 -0.076799
N  5.921429 -1.737584 0.025932
C  -1.03234 1.557284 -0.001939
C  -0.485895 2.963453 -0.044244
C  -2.449027 1.175241 0.020697
C  1.039148 2.745353 -0.049808
C  -2.818647 -0.20006 0.03685
C  2.346673 0.49867 -0.006725
C  -4.180478 -0.503543 0.059984
C  -3.471539 2.164094 0.022742
C  -5.218882 0.445448 0.066521
C  -4.836302 1.80499 0.049011
C  2.236906 -0.920022 0.074744
C  3.42206 -1.669739 0.085752
C  4.655474 -0.980432 0.015838
C  4.67367 0.431087 -0.064653
H  -0.786785 3.524532 -0.947426
H  -0.771926 3.574345 0.830885
H  -2.050503 -0.979618 0.038727
H  -3.200177 3.224983 0.008021
H  -6.268657 0.138368 0.093223
H  -5.607164 2.581234 0.05339
H  1.257077 -1.395545 0.12665
H  3.413264 -2.760953 0.147066
H  5.620335 0.975438 -0.121645
