program: Gaussian 09
title: 000292398
version: EM64L-G09RevD.01
frameworkgroup: C1[X(C17H16Br2N2O)]
method: RPBEPBE
basis: SDD
operation: Freq
keyword: #p
keyword: freq=noraman
keyword: PBEPBE/SDD
title: #p freq=noraman PBEPBE/SDD
converged: YES YES NO NO
title: Mulliken charges:
elementType: Br Br O N N C C C C C C C C C C C C C C C C C H H H H H H H H H H H H H H H H
charge: 0.020311 0.007756 -0.432746 -0.420403 -0.085866 -0.017661 -0.420402 -0.023187 0.207938 0.352794 -0.377880 0.285800 -0.040371 -0.681701 -0.268278 -0.375231 -0.360496 -0.269353 -0.281248 -0.215185 -0.234742 -0.235018 0.238578 0.184897 0.246869 0.306469 0.204716 0.237537 0.219854 0.221545 0.210593 0.214922 0.233827 0.223069 0.274587 0.255097 0.251023 0.341586
chargesum: 0.00000
title: Mulliken charges with hydrogens summed into heavy atoms:
elementType: Br Br O N N C C C C C C C C C C C C C C C C C
charge: 0.020311 0.007756 -0.091160 -0.113934 -0.085866 0.220917 0.011365 -0.023187 0.207938 0.352794 0.064373 0.285800 -0.040371 -0.029709 -0.053356 -0.141404 -0.137427 0.005233 -0.281248 0.039912 0.016281 -0.235018
polarizability: 4.19890866e+02 7.43797205e+00 2.68243882e+02 -2.48291164e+00 -2.79738449e-01 1.08948943e+02
1716.lowfreq: -6.8384 -3.6848 0.0001 0.0005 0.0005 2.5528 16.0943 25.5133 39.7515
frequency: 15.4205 25.4892 39.7454 50.3037 78.6911 82.6704 90.8020 95.9980 111.8060 137.0531 166.2738 173.3337 183.7814 211.7942 228.1243 261.1272 275.4182 283.2853 297.3591 323.0923 340.9376 344.7545 363.9049 384.4863 440.5214 460.3102 464.3001 482.7836 491.6129 518.5691 536.1704 548.8866 592.7761 613.8334 643.0026 674.6062 709.0119 715.8950 726.6136 769.7815 777.3214 811.2724 814.2655 833.8470 836.3244 861.8776 891.5470 917.8187 944.5486 946.9705 967.7064 979.1297 984.8204 985.5773 1030.2956 1062.2627 1065.8944 1083.1072 1089.1508 1114.6500 1136.7105 1150.9539 1162.8076 1183.9911 1236.5742 1243.6359 1266.8316 1268.2063 1291.4232 1303.4211 1314.6289 1321.8626 1343.1941 1358.1380 1362.4767 1374.3831 1387.6163 1393.3048 1399.0207 1419.0729 1444.4632 1451.3091 1463.9816 1471.8673 1474.6193 1485.5417 1502.1138 1524.9158 1544.4162 1573.3792 1599.6515 1604.5945 2954.9014 2979.6989 2999.3476 3006.4191 3043.4299 3075.6246 3077.0608 3079.8115 3141.1471 3156.1483 3156.9915 3177.0080 3178.3539 3180.4091 3565.8587 3585.8094
redmass: 3.9156 9.1423 4.9218 6.0772 6.5752 5.3185 4.9075 3.2995 2.7351 4.5129 28.3481 1.5984 3.8961 5.7618 1.9833 3.6866 5.1946 7.2098 3.8184 1.9493 3.3183 1.9866 2.1609 2.2039 2.4615 3.3559 5.8108 3.3639 4.6695 7.7254 3.4747 4.7029 4.6364 5.3814 7.2384 5.6337 6.1038 6.8325 3.7894 1.9988 1.3739 1.4082 5.2429 2.0040 1.9964 1.8433 1.5610 4.5528 1.7500 1.3737 1.3510 2.6373 2.4562 4.5416 3.9479 1.9427 2.0825 2.0808 2.7674 1.9640 1.8650 1.4505 2.1824 1.5986 1.4638 1.6009 1.3857 2.4819 1.7091 1.6726 1.1537 1.6616 1.6208 1.3768 2.2023 1.5853 3.6416 1.2320 4.8851 5.7134 2.9454 2.7251 1.1135 1.1342 1.0473 1.0735 2.4849 3.4971 6.8025 9.5588 6.7782 6.6485 1.0682 1.0361 1.0629 1.0796 1.0938 1.0998 1.1054 1.0997 1.0889 1.0893 1.0886 1.0963 1.0948 1.0944 1.0662 1.0766
irintensity: 0.1381 0.7975 0.2217 1.0260 0.4598 0.0961 2.9167 0.8863 5.1215 0.2771 0.0954 1.2206 1.4262 0.1416 3.6110 1.3453 4.3107 8.7780 6.3182 24.6270 11.9381 61.9739 64.4319 7.1418 45.5514 7.9572 2.5177 18.2275 9.2238 1.1476 26.0304 2.4103 4.1542 1.4601 8.9682 0.4539 13.1906 86.1196 8.5159 10.2211 13.4462 66.0377 2.5250 14.4782 10.8323 10.9393 19.4220 50.5663 90.7588 0.1267 0.0965 43.6397 3.7854 48.4938 6.0549 27.3034 9.8699 2.7112 22.8830 30.7561 0.2151 2.9749 2.1919 11.5387 16.2753 7.4961 1.1724 30.1444 7.2056 2.7719 12.1074 38.9659 0.1734 19.6047 4.1359 7.7965 30.9092 16.4087 30.7803 25.4306 103.2146 91.5615 11.8935 48.7617 17.8184 31.3097 65.3943 441.4225 118.5068 190.9186 108.0043 19.3071 32.7004 28.5845 16.3887 32.1895 2.2973 52.8301 14.9184 60.7484 6.6137 11.7146 0.0605 0.7066 10.2497 2.2297 10.2372 48.5879
temp: 298.150 k
press: 1.00000 atm
elementType: 35 35 8 7 7 6 6 6 6 6 6 6 6 6 6 6 6 6 6 6 6 6 1 1 1 1 1 1 1 1 1 1 1 1 1 1 1 1
symmnumber: 1
zpe: 761840.8 jmol-1
zpe.correction: 0.290170 hartree
zpe.thermalcorrener: 0.311450 hartree
zpe.thermalcorrenthalpy: 0.312394 hartree
zpe.thermalcorrgfe: 0.236494 hartree
zpe.sumelectzpe: -867.507455 hartree
zpe.sumelectthermal: -867.486175 hartree
zpe.sumelectthermalent: -867.485231 hartree
zpe.sumelectthermalfe: -867.561131 hartree
dipole: 2.5091 -1.3364 0.7507
dipole: 2.9403
quadrupole: -156.7881 -141.9206 -155.4133
quadrupole: 4.1950 -0.7214 6.8426
quadrupole: -5.4141 9.4533 -4.0393 4.1950 -0.7214 6.8426
hfenergy: -867.7976246 hartree
pointgroup: C01 [X(C17H16Br2N2O1)]
dipole: -0.3793755 1.0142181 0.4069592 debye
polarizability: 360.9414115|-72.7714724|324.4894409|-18.71416|21.5157452|111.6528385 unknown
InChI: InChI=1S/C17H16Br2N2O/c1-2-12(9-22)20-17-15-7-10(18)3-5-13(15)14-6-4-11(19)8-16(14)21-17/h3-8,12,20,22H,2,9H2,1H3
charge 0 multiplicity 1
38 atoms
Br -2.632731 4.913743 0.48881
Br 5.134387 -2.897839 -0.426551
O  -2.654066 -4.03167 -1.583921
N  -2.139962 -0.643836 0.014586
N  0.127722 -1.146207 -0.12012
C  -2.518236 -2.070518 -0.04537
C  -3.90167 -2.285338 0.602613
C  -0.828914 -0.209156 -0.011509
C  -0.527941 1.233223 0.090833
C  0.851464 1.638903 0.057375
C  -2.488258 -2.572343 -1.51608
C  1.890194 0.615983 -0.057955
C  1.464696 -0.758095 -0.134836
C  -3.912447 -2.078927 2.132008
C  -1.55101 2.217741 0.220896
C  1.146782 3.03237 0.146548
C  3.28524 0.899257 -0.095327
C  2.440255 -1.79655 -0.242933
C  -1.213402 3.571763 0.306694
C  0.13815 3.996616 0.26849
C  4.242155 -0.121065 -0.202484
C  3.796208 -1.467172 -0.274848
H  -1.74466 -2.630859 0.51572
H  -4.63999 -1.608597 0.119728
H  -4.22033 -3.31467 0.354222
H  -2.897037 0.036533 0.047502
H  -3.343728 -2.165632 -2.083053
H  -1.54291 -2.252325 -1.994345
H  -3.238626 -2.800163 2.630293
H  -4.926862 -2.224742 2.544981
H  -3.574958 -1.063553 2.411272
H  -2.608397 1.941227 0.261052
H  2.185697 3.372776 0.121339
H  3.642752 1.932212 -0.039177
H  2.087954 -2.829019 -0.29838
H  0.387068 5.059078 0.335847
H  5.309322 0.11331 -0.229633
H  -1.822308 -4.458759 -1.257184
