program: Gaussian 09
title: 000292380
version: EM64L-G09RevD.01
frameworkgroup: C1[X(C11H10N4O4)]
method: RPBEPBE
basis: SDD
operation: Freq
keyword: #p
keyword: freq=noraman
keyword: PBEPBE/SDD
title: #p freq=noraman PBEPBE/SDD
converged: YES YES NO NO
title: Mulliken charges:
elementType: O O O O N N N N C C C C C C C C C C C H H H H H H H H H H
charge: -0.237697 -0.266502 -0.209520 -0.212913 -0.277361 -0.139780 -0.611446 0.021416 0.473405 0.348326 0.182166 -0.490599 -0.667976 -0.333857 -0.351893 0.176935 -0.359813 -0.361961 0.390742 0.275142 0.240569 0.265090 0.303684 0.295963 0.278788 0.289907 0.290465 0.349105 0.339617
chargesum: 0.00000
title: Mulliken charges with hydrogens summed into heavy atoms:
elementType: O O O O N N N N C C C C C C C C C C C
charge: -0.237697 -0.266502 -0.209520 -0.212913 -0.277361 -0.139780 0.077276 0.021416 0.473405 0.348326 0.182166 -0.215457 0.141367 -0.037894 -0.073105 0.176935 -0.069906 -0.071497 0.390742
polarizability: 3.07326956e+02 -1.11152624e+01 1.72888212e+02 4.48156180e+00 7.96225598e+00 8.18729894e+01
1716.lowfreq: -6.2777 -2.0001 0.0004 0.0005 0.0007 7.0736 34.8322 47.3572 55.3714
frequency: 34.8162 47.3557 55.3659 63.0686 87.5146 136.2128 147.9177 149.1115 176.3168 194.9894 222.0722 232.6970 287.3198 315.3399 324.5124 394.0770 397.5223 411.1568 418.5704 494.9232 500.0427 504.5880 512.0808 544.0410 598.2054 608.1594 617.9081 627.3360 657.1094 669.9048 680.6240 705.2886 731.8588 744.3531 788.6238 804.2878 817.6628 837.8856 862.2202 967.5964 982.0976 989.8598 1000.6338 1012.4586 1055.9387 1082.2746 1095.0800 1117.0881 1125.2800 1148.6772 1179.8397 1193.4395 1206.6659 1222.7257 1298.4513 1308.5302 1342.7706 1360.5003 1398.2539 1409.1602 1428.8359 1438.8746 1485.1172 1486.5400 1494.9997 1535.5384 1582.7821 1588.9341 1605.5458 1636.1318 1653.2287 2990.3178 3101.8891 3141.0353 3160.6245 3181.4374 3185.9854 3203.1613 3239.4011 3524.9341 3677.6512
redmass: 5.9409 8.2565 8.0501 6.5712 5.1321 7.4344 4.0699 5.0290 1.3525 3.6567 5.7304 5.8208 4.6886 6.7081 4.0413 5.2990 8.5490 5.8567 3.0938 3.4700 3.1475 3.0251 2.2879 2.0869 3.2925 4.0495 3.0743 3.5690 5.2443 4.6474 3.2370 6.8041 5.0544 4.5422 7.9871 1.9206 4.1127 1.3343 1.5729 5.6388 1.3350 1.3776 3.8212 3.6173 1.8739 2.3039 3.0684 1.3344 1.3991 1.7427 1.4403 5.3976 2.2018 4.6157 1.3172 3.9867 4.1285 8.0818 6.6124 2.3671 3.5886 1.6493 1.5597 1.5094 1.1639 6.7684 2.0607 6.6147 6.1253 2.3890 10.2395 1.0406 1.0936 1.1023 1.0899 1.0902 1.0958 1.0967 1.0984 1.0451 1.1046
irintensity: 1.1608 1.9438 1.6590 13.9604 2.1937 0.3859 0.9898 3.2627 3.0292 9.6005 11.1029 8.0631 5.3675 1.6856 2.4015 2.1201 4.6296 4.7944 3.3158 10.6935 4.4579 12.4722 34.0520 138.1706 12.0211 19.0910 41.5877 44.8805 15.4040 24.1195 0.5215 11.3238 5.9369 61.4521 18.6385 42.8664 13.2839 10.4785 60.9345 36.6769 3.1283 2.7032 16.0742 10.0046 5.1169 4.1812 23.0625 27.3937 5.8124 97.0033 181.8483 16.7185 80.6449 433.6483 9.9536 398.2424 4.8022 99.0566 11.7874 37.3036 16.4458 106.3280 119.6891 35.1024 0.8101 91.2385 198.0337 13.5705 151.9603 219.8829 310.3498 45.7363 14.3143 2.3178 2.5490 0.9030 3.0739 1.3385 0.6691 76.8378 42.5298
temp: 298.150 k
press: 1.00000 atm
elementType: 8 8 8 8 7 7 7 7 6 6 6 6 6 6 6 6 6 6 6 1 1 1 1 1 1 1 1 1 1
symmnumber: 1
zpe: 545756.3 jmol-1
zpe.correction: 0.207868 hartree
zpe.thermalcorrener: 0.224659 hartree
zpe.thermalcorrenthalpy: 0.225603 hartree
zpe.thermalcorrgfe: 0.162414 hartree
zpe.sumelectzpe: -943.622208 hartree
zpe.sumelectthermal: -943.605417 hartree
zpe.sumelectthermalent: -943.604472 hartree
zpe.sumelectthermalfe: -943.667661 hartree
dipole: -8.5882 -0.3802 2.0888
dipole: 8.8467
quadrupole: -116.3825 -121.6993 -108.1593
quadrupole: -6.5550 -0.7593 -0.0146
quadrupole: -0.9688 -6.2856 7.2544 -6.5550 -0.7593 -0.0146
hfenergy: -943.8300753 hartree
pointgroup: C01 [X(C11H10N4O4)]
dipole: -3.3918399 -0.1388231 0.7684394 debye
polarizability: 307.225849|-10.1338431|173.2396397|8.8021403|4.1916723|81.6226689 unknown
InChI: InChI=1S/C11H10N4O4/c1-13-9(11(12)17)6-10(16)14(13)7-2-4-8(5-3-7)15(18)19/h2-6H,12H2,1H3
charge 0 multiplicity 1
29 atoms
O  -0.919522 2.844133 -0.480648
O  -4.248756 -2.111062 -0.238614
O  5.526874 0.536287 0.36486
O  5.159391 -1.570107 -0.435479
N  -0.87135 0.519008 0.155397
N  -1.818515 -0.545535 0.195354
N  -5.474255 -0.13693 -0.218516
N  4.744234 -0.417904 -0.019452
C  0.523447 0.263945 0.114726
C  -3.051818 0.009043 -0.171905
C  -1.521191 1.750356 -0.300121
C  -2.905845 1.348419 -0.507605
C  -1.679771 -1.561823 1.270771
C  1.416395 1.285797 0.539934
C  1.027256 -0.971072 -0.382169
C  -4.287234 -0.842427 -0.206739
C  2.80223 1.063603 0.487794
C  2.412072 -1.197682 -0.421819
C  3.286003 -0.179084 0.020369
H  -3.649072 2.013704 -0.939924
H  -1.810665 -1.100255 2.26773
H  -0.688625 -2.034564 1.22013
H  -2.453103 -2.322891 1.092786
H  1.016171 2.238968 0.88952
H  0.33598 -1.721449 -0.777124
H  3.512602 1.82904 0.809854
H  2.827871 -2.133283 -0.804265
H  -6.343016 -0.664451 -0.300257
H  -5.511588 0.875819 -0.119389
