program: Gaussian 09
title: 000292346
version: EM64L-G09RevD.01
frameworkgroup: C1[X(C11H12N2O)]
method: RPBEPBE
basis: SDD
operation: Freq
keyword: #p
keyword: freq=noraman
keyword: PBEPBE/SDD
title: #p freq=noraman PBEPBE/SDD
converged: YES YES NO NO
title: Mulliken charges:
elementType: O N N C C C C C C C C C C C H H H H H H H H H H H H
charge: -0.284260 -0.152223 -0.603816 0.289985 -0.013474 -0.503875 0.341559 -0.673715 -0.388149 -0.385739 0.122789 -0.250953 -0.239415 -0.245912 0.232271 0.233416 0.223008 0.219750 0.230137 0.227724 0.272375 0.222082 0.223712 0.226109 0.340516 0.336098
chargesum: 0.00000
title: Mulliken charges with hydrogens summed into heavy atoms:
elementType: O N N C C C C C C C C C C C
charge: -0.284260 -0.152223 0.072799 0.289985 -0.013474 -0.038188 0.341559 -0.000819 -0.160425 -0.113364 0.122789 -0.028871 -0.015704 -0.019803
polarizability: 1.98777102e+02 1.31199190e-01 1.49486505e+02 -1.32330607e+00 1.61439574e+00 6.68403321e+01
1716.lowfreq: -9.7535 -5.9257 -1.9389 -0.0008 -0.0006 0.0003 32.5820 63.4174 89.5650
frequency: 32.4449 63.3533 89.5633 120.1795 140.4897 193.0619 221.4634 276.0549 282.9558 299.7902 315.8107 344.9838 384.4116 407.5398 415.2782 508.1034 524.2807 609.9792 615.5449 659.7290 675.1470 690.3175 701.8670 752.9276 772.7958 777.8497 853.0538 878.5995 925.3076 930.0821 960.4408 979.1907 988.4347 998.5062 1007.8677 1033.0103 1056.2591 1065.0002 1084.2022 1149.5197 1168.2215 1171.5696 1189.1353 1260.8054 1303.2424 1319.8704 1325.9315 1360.1778 1381.1365 1388.7321 1436.2488 1463.4169 1471.7706 1483.3352 1488.5825 1576.2716 1584.3923 1602.1183 1618.1509 1673.9245 2984.2571 2995.2008 3049.5265 3082.5215 3092.1999 3122.2530 3132.7879 3149.9617 3160.8327 3169.6588 3585.7356 3735.5035
redmass: 3.1939 3.0833 4.7423 3.8560 4.7140 1.1580 5.4136 2.3377 4.1955 1.7957 1.6652 4.3832 1.2659 2.8675 2.9033 3.7652 3.6216 4.1631 6.3229 6.6929 6.7137 7.5911 1.7203 4.5273 1.4159 1.9536 1.2482 4.3780 1.5415 3.7671 2.6275 1.3891 5.5054 1.3418 3.0771 2.0234 2.0996 1.7095 1.6516 3.2032 2.7871 1.1154 1.1200 1.2944 1.5690 1.5567 2.5939 2.9893 5.8530 1.2855 2.3099 1.0886 1.0564 1.3760 1.6067 2.4845 1.9671 5.9703 5.7304 6.2660 1.0349 1.0613 1.0995 1.1004 1.1010 1.0845 1.0888 1.0932 1.0953 1.0991 1.0446 1.1058
irintensity: 0.1193 0.1317 5.1982 0.9097 0.6742 0.7923 0.5796 2.2861 0.1178 51.2419 76.3492 8.8835 208.6419 0.1341 20.0465 6.2621 0.4205 1.5176 0.2304 13.0693 1.7647 20.9341 56.9292 2.3047 2.3448 43.9695 0.6567 12.3754 9.5151 45.6067 25.0882 0.9030 0.3647 1.3982 10.5439 1.7206 13.5927 2.3387 11.9145 2.5985 35.7044 5.0999 0.6043 7.2450 13.0375 6.7504 18.4237 24.4715 11.9182 11.1333 11.0098 9.4486 7.5289 16.7810 12.2725 5.8975 3.3926 47.1678 18.4554 619.2085 37.9944 24.0262 5.0563 53.5790 34.8213 1.1636 12.6843 37.0805 23.5824 11.0293 137.9152 56.6777
temp: 298.150 k
press: 1.00000 atm
elementType: 8 7 7 6 6 6 6 6 6 6 6 6 6 6 1 1 1 1 1 1 1 1 1 1 1 1
symmnumber: 1
zpe: 546172.3 jmol-1
zpe.correction: 0.208026 hartree
zpe.thermalcorrener: 0.220949 hartree
zpe.thermalcorrenthalpy: 0.221893 hartree
zpe.thermalcorrgfe: 0.168179 hartree
zpe.sumelectzpe: -610.085634 hartree
zpe.sumelectthermal: -610.072711 hartree
zpe.sumelectthermalent: -610.071766 hartree
zpe.sumelectthermalfe: -610.125480 hartree
dipole: -2.3736 0.3964 0.1423
dipole: 2.4107
quadrupole: -64.2787 -70.8881 -87.3516
quadrupole: 7.6185 0.6590 0.8077
quadrupole: 9.8941 3.2847 -13.1788 7.6185 0.6590 0.8077
hfenergy: -610.2936598 hartree
pointgroup: C01 [X(C11H12N2O1)]
dipole: 0.9195883 0.1883173 -0.1358281 debye
dipolederiv: -0.9664324 -0.1269846 0.0829849 0.2666586 -0.4375472 0.2987539 -0.2858627 0.2626646 -0.3517237 -1.0707056 0.3583273 -0.256211 -0.0612339 -0.3975438 0.0925563 -0.0068271 0.0996878 -0.3414675 -1.3127199 0.5167967 -0.4059569 0.5727336 -0.6808526 -0.0636011 -0.4754136 -0.0488926 -0.6972621 0.5793742 -0.007303 0.013562 0.1134951 0.0607791 -0.1553068 0.0108468 -0.1515089 0.0447747 0.2864225 -0.1377796 0.1072175 -0.2448018 0.1524321 -0.1471041 0.2334128 -0.0974528 0.074141 0.0793603 -0.0110433 0.0120391 0.0231239 0.0787507 0.0359182 -0.1057924 -0.027946 0.1364888 0.4871978 0.1033296 -0.0735057 0.0831768 0.0137911 0.0174984 -0.1091125 -0.005466 0.0317791 0.0762215 0.005153 -0.0143766 -0.0155735 -0.0104402 -0.0275999 0.0380507 0.0308853 -0.0055489 -0.1691908 0.0159886 0.0119986 0.1211338 0.0291328 -0.0664636 -0.0286366 -0.0631189 -0.1397067 -0.1818976 -0.0877837 0.0387481 -0.1436922 -0.0374647 -0.0388373 0.0831286 -0.0508471 -0.1275844 1.7474934 -0.5551527 0.412129 -0.6262113 0.604128 -0.3383045 0.5496704 -0.3165851 0.4984675 0.0271964 -0.0512719 0.0183164 -0.1276052 0.0351874 -0.0686903 0.0396795 -0.0749545 -0.1273173 0.0486931 0.0829251 -0.0339121 0.1072702 0.0877863 -0.1050643 -0.0352237 -0.1009506 -0.114768 -0.0230563 -0.018111 0.0129168 0.0256569 -0.089219 -0.0377596 -0.0090096 -0.0341191 -0.1606791 -0.0258583 -0.002161 0.1512608 0.0127006 0.0141815 -0.004498 0.1123478 0.0150976 -0.0385541 -0.0483072 -0.0108806 -0.135429 -0.023406 0.0105722 -0.0034108 -0.0825476 -0.0173411 0.0507857 -0.0423199 0.0512539 0.1215573 0.0172038 0.0856794 -0.0260896 0.1114183 -0.0421446 -0.0177934 0.0968858 0.0103737 -0.0149492 -0.03695 -0.1481085 0.146165 -0.0000075 0.1526514 -0.0466641 -0.0921437 -0.0594754 -0.0948836 0.0139806 0.0798128 -0.0202908 -0.0962041 -0.0424699 0.0444839 0.062215 -0.0809205 0.0228103 -0.0809859 -0.0563491 0.0689458 0.0179518 0.0674887 0.1075914 0.1056336 0.072558 -0.022831 0.0727985 0.0284266 0.0497589 -0.0178742 0.0557721 0.1317419 -0.0019664 0.0820494 -0.0324383 0.115466 -0.0367259 0.0751039 -0.0458856 0.0737608 0.1269608 0.0225845 -0.0790187 0.0324828 -0.1048188 -0.0600161 0.0900185 0.0407884 0.0901981 0.1171684 -0.1537531 -0.0179952 0.0070507 -0.0145944 0.0982567 0.0267588 0.006333 0.0277469 0.1523854 0.1804357 -0.0210209 0.015744 -0.0756882 0.3165557 0.0766654 0.0574354 0.0737399 0.3445098 0.2886376 -0.0318531 0.0236751 0.0101629 0.2587946 0.1248777 -0.0026663 0.1241039 0.3077909 unknown
polarizability: 198.4712654|4.2464377|131.0840401|-0.0749012|-34.6872992|85.5486333 unknown
InChI: InChI=1S/C11H12N2O/c1-2-9-10(13-11(12)14-9)8-6-4-3-5-7-8/h3-7H,2,12H2,1H3
charge 0 multiplicity 1
26 atoms
O  2.662237 0.251135 -0.134192
N  1.21305 -1.13832 0.98575
N  3.618534 -1.420541 1.242055
C  1.319179 0.651509 -0.475037
C  0.456823 -0.188118 0.219383
C  1.217211 1.782549 -1.44947
C  -1.014697 -0.23277 0.249179
C  1.333451 3.18822 -0.797134
C  -1.827126 0.85246 -0.18494
C  -1.655161 -1.403251 0.74478
C  2.480201 -0.835096 0.749747
C  -3.234398 0.755845 -0.151406
C  -3.061333 -1.495123 0.780366
C  -3.860549 -0.418851 0.326787
H  2.018081 1.668509 -2.2050
H  0.258648 1.697408 -1.992659
H  0.528035 3.353514 -0.05903
H  1.269165 3.98017 -1.565556
H  2.298962 3.2933 -0.272158
H  -1.365804 1.785941 -0.522514
H  -1.025525 -2.225006 1.099246
H  -3.84348 1.603116 -0.486987
H  -3.536078 -2.405785 1.163206
H  -4.953626 -0.489979 0.354739
H  3.527033 -2.196035 1.88998
H  4.533269 -1.0841 0.960162
