program: Gaussian 09
title: 000292364
version: EM64L-G09RevD.01
frameworkgroup: C1[X(C17H17N3O)]
method: RPBEPBE
basis: SDD
operation: Freq
keyword: #p
keyword: freq=noraman
keyword: PBEPBE/SDD
title: #p freq=noraman PBEPBE/SDD
converged: YES YES NO NO
title: Mulliken charges:
elementType: O N N N C C C C C C C C C C C C C C C C C H H H H H H H H H H H H H H H H H
charge: -0.260300 -0.176085 -0.297003 -0.704564 0.373418 -0.410813 -0.551275 0.161933 0.400898 0.455818 -0.660818 -0.589603 -0.454489 -0.370283 -0.385668 0.501455 -0.196015 -0.428647 -0.215917 -0.214250 -0.254001 0.252208 0.254287 0.283220 0.231703 0.242572 0.220357 0.249133 0.252138 0.289774 0.256347 0.224439 0.221801 0.227504 0.224396 0.228383 0.308931 0.309019
chargesum: 0.00000
title: Mulliken charges with hydrogens summed into heavy atoms:
elementType: O N N N C C C C C C C C C C C C C C C C C
charge: -0.260300 -0.176085 -0.297003 -0.086614 0.373418 0.095682 -0.268055 0.161933 0.400898 0.455818 0.033813 -0.340470 -0.202351 -0.080509 -0.129321 0.501455 0.028423 -0.206846 0.011587 0.010146 -0.025618
polarizability: 3.31387922e+02 -2.93810659e-01 2.23293278e+02 3.36432310e+00 6.13503493e+00 1.14564323e+02
1716.lowfreq: -6.5946 -3.7620 0.0003 0.0005 0.0007 6.8639 30.9838 40.8329 45.8675
frequency: 30.9263 40.4094 45.8613 59.1432 75.8896 98.6289 104.8118 132.1887 200.2455 218.8419 224.0940 229.9200 245.5001 273.5042 290.7133 300.1758 376.6031 378.4315 379.6804 396.4616 410.3839 437.2670 456.7223 488.5495 506.4546 527.9566 570.5276 594.7629 612.6652 637.2052 657.3653 669.9381 687.4762 697.6260 701.8199 712.4440 754.3669 767.4686 794.3753 807.3701 810.0724 841.0220 871.9651 879.2919 891.7514 910.2054 948.7619 968.2164 970.7440 979.8704 981.8778 985.4573 989.3475 994.5710 1029.1896 1034.8090 1064.2481 1079.2181 1089.7096 1106.5603 1133.7738 1157.9591 1171.4945 1180.4962 1182.1155 1186.6249 1211.0094 1272.0393 1302.8745 1318.6642 1322.4817 1339.7238 1347.0338 1375.6593 1386.2812 1387.2133 1394.6556 1443.4574 1444.5949 1466.9998 1470.5138 1482.3148 1484.8092 1492.1714 1576.1138 1587.1918 1592.1348 1608.4833 1626.7339 1639.2041 1645.0831 2991.0241 3034.3691 3083.2436 3089.2749 3108.1785 3121.4035 3124.7222 3126.7117 3138.0700 3142.7147 3152.9133 3164.6128 3165.1380 3191.9067 3243.2921 3566.2136 3705.9790
redmass: 4.0445 2.9659 4.1798 4.7634 5.0530 4.1145 3.3387 4.8964 1.2383 3.5935 4.8741 4.4132 6.0010 6.5389 2.5482 3.7185 1.2268 4.5458 1.0611 3.2543 2.9608 3.5883 4.4928 3.6315 3.6080 6.1411 4.2056 5.4603 6.3723 4.3681 7.0978 6.0147 4.0876 2.1938 1.9138 3.8814 2.1051 1.9444 1.6230 1.6492 1.5589 1.2521 3.4734 1.4841 1.5281 1.4170 2.5004 1.3973 1.3401 5.7929 4.5835 2.6157 1.8173 2.8223 2.0013 1.6902 2.1234 2.0878 1.7047 1.4725 2.2065 4.4266 1.0519 1.1692 1.7468 1.2928 1.9236 1.5366 1.8410 1.4411 1.6389 2.4598 1.4673 3.5712 1.5956 2.6790 6.6548 2.3462 3.2530 1.0430 1.0914 1.1039 2.3673 2.8192 8.2253 6.5112 5.9614 6.0772 4.7719 6.3072 1.3517 1.0354 1.0610 1.1008 1.0992 1.1033 1.0877 1.0906 1.0850 1.0892 1.0919 1.0939 1.0982 1.0995 1.0958 1.0984 1.0450 1.1040
irintensity: 0.3915 0.2250 0.2569 0.6341 1.0982 0.8806 2.1454 1.8128 0.5155 3.8613 0.7962 4.6738 3.4929 8.9637 2.2611 0.9563 276.7848 8.8234 17.4142 0.8050 1.0512 0.7920 2.8000 11.0155 13.7004 0.9456 3.2032 22.7314 0.8866 4.4736 1.9129 3.4789 4.2484 27.6169 21.2286 10.7768 62.0075 27.3512 78.6836 16.6303 24.7787 1.5002 2.7239 4.6419 27.8462 5.6662 5.8034 2.1457 0.8867 5.6636 6.2731 3.8450 1.0201 12.0510 15.2907 2.7061 4.6160 6.8901 24.5199 28.3489 66.2252 8.9024 0.0837 3.2551 8.8435 3.0971 13.0078 13.2778 70.5605 32.3391 28.3966 111.4534 19.5202 21.9411 20.3512 17.1224 7.9655 10.5367 11.9575 8.0955 10.3851 4.7974 130.2875 78.4537 30.8509 5.3558 38.6388 61.6750 130.2633 529.3298 128.7383 15.8567 18.6671 2.5159 25.5562 30.5725 6.0657 13.8805 2.6815 13.2678 25.0156 31.3385 14.6467 19.9120 1.9892 0.8667 70.6056 20.8688
temp: 298.150 k
press: 1.00000 atm
elementType: 8 7 7 7 6 6 6 6 6 6 6 6 6 6 6 6 6 6 6 6 6 1 1 1 1 1 1 1 1 1 1 1 1 1 1 1 1 1
symmnumber: 1
zpe: 797917.2 jmol-1
zpe.correction: 0.303911 hartree
zpe.thermalcorrener: 0.322604 hartree
zpe.thermalcorrenthalpy: 0.323548 hartree
zpe.thermalcorrgfe: 0.256334 hartree
zpe.sumelectzpe: -895.991610 hartree
zpe.sumelectthermal: -895.972917 hartree
zpe.sumelectthermalent: -895.971972 hartree
zpe.sumelectthermalfe: -896.039187 hartree
dipole: 4.8456 -5.9236 2.0025
dipole: 7.9107
quadrupole: -101.8520 -117.7829 -127.8726
quadrupole: 1.0470 -6.3293 9.0643
quadrupole: 13.9838 -1.9470 -12.0368 1.0470 -6.3293 9.0643
hfenergy: -896.2955205 hartree
pointgroup: C01 [X(C17H17N3O1)]
dipole: 1.8508817 2.3823271 -0.7649298 debye
polarizability: 331.3165936|3.5022466|223.5037058|1.3197669|5.2524058|114.4252233 unknown
InChI: InChI=1S/C17H17N3O/c1-2-19-16(13-7-6-8-14(18)11-13)12-17(21)20(19)15-9-4-3-5-10-15/h3-12H,2,18H2,1H3
charge 0 multiplicity 1
38 atoms
O  -1.945265 -2.771397 0.874146
N  -0.106192 0.124355 -0.143227
N  -1.32973 -0.605304 0.029324
N  4.474436 2.667551 0.806192
C  0.932338 -0.761472 0.249743
C  0.007958 0.868073 -1.444188
C  0.398273 -1.958493 0.693971
C  -1.055505 -1.924847 0.567657
C  2.349147 -0.353153 0.184224
C  -2.580675 0.074485 0.044715
C  -0.045496 -0.0454 -2.68427
C  2.732612 0.973345 0.505975
C  3.339201 -1.309584 -0.168431
C  -3.766786 -0.655679 -0.233551
C  -2.654617 1.458748 0.356053
C  4.100151 1.363852 0.478494
C  4.69625 -0.921933 -0.195459
C  5.08395 0.395746 0.117406
C  -5.011317 0.007496 -0.205382
C  -3.906138 2.109698 0.363058
C  -5.091048 1.390734 0.081207
H  -0.803597 1.613833 -1.476944
H  0.96579 1.411222 -1.401186
H  0.940613 -2.783524 1.148279
H  0.791514 -0.765558 -2.684996
H  -0.993569 -0.608912 -2.722814
H  0.027214 0.568475 -3.600273
H  1.967206 1.690759 0.82722
H  3.041694 -2.329272 -0.431405
H  -3.701761 -1.726007 -0.439783
H  -1.742796 2.000907 0.627132
H  5.463102 -1.654662 -0.470692
H  6.143062 0.679928 0.092019
H  -5.923774 -0.56205 -0.413837
H  -3.956007 3.17712 0.606467
H  -6.061559 1.898354 0.093246
H  3.782875 3.353823 1.0933
H  5.453147 2.938644 0.819715
