program: Gaussian 09
title: 000292343
version: EM64L-G09RevD.01
frameworkgroup: C1[X(C15H20N2O2)]
method: RPBEPBE
basis: SDD
operation: Freq
keyword: #p
keyword: freq=noraman
keyword: PBEPBE/SDD
title: #p freq=noraman PBEPBE/SDD
converged: YES YES NO NO
title: Mulliken charges:
elementType: O O N N C C C C C C C C C C C C C C C H H H H H H H H H H H H H H H H H H H H
charge: -0.342973 -0.253384 0.033144 -0.398251 -0.447001 -0.553225 -0.547655 0.267744 0.250575 -0.534034 -0.391617 0.485015 -0.412127 0.336949 -0.708452 -0.701490 -0.708524 -0.405413 0.343459 0.225564 0.225711 0.232446 0.232487 0.229947 0.229884 0.288638 0.238686 0.220290 0.208998 0.219302 0.270485 0.226795 0.226784 0.205522 0.270534 0.219292 0.209012 0.204900 0.301982
chargesum: 0.00000
title: Mulliken charges with hydrogens summed into heavy atoms:
elementType: O O N N C C C C C C C C C C C C C C C
charge: -0.342973 -0.253384 0.033144 -0.096269 0.004274 -0.088292 -0.087824 0.267744 0.250575 -0.245396 -0.152931 0.485015 -0.191837 0.336949 -0.009666 -0.042389 -0.009686 -0.200513 0.343459
polarizability: 3.51388466e+02 5.55682253e+00 1.81788191e+02 2.26019499e-02 2.12672236e-02 1.09073451e+02
1716.lowfreq: -130.5760 -4.7345 -1.7527 -0.0007 0.0002 0.0007 10.4732 27.3185 30.8567
frequency: -130.5760 27.2911 30.8512 36.2750 59.6268 106.0401 115.9028 121.8337 174.0853 177.4732 190.0502 203.3455 224.0405 236.9796 242.3523 255.6781 300.4067 327.3812 340.9548 354.8648 362.6045 406.4518 430.6623 433.2409 449.1917 492.3231 560.2740 560.4557 599.2628 635.4482 681.9490 690.9716 703.3990 709.6524 740.6030 748.1400 782.2083 801.0098 824.3886 829.7101 896.0801 909.1283 914.2303 918.6815 929.6751 936.9394 944.2166 951.6985 961.1254 987.7430 1026.5629 1031.3202 1031.8954 1040.5819 1099.3113 1105.4615 1133.0849 1142.7049 1160.4544 1196.7545 1199.4705 1201.4822 1216.5701 1237.7550 1252.9801 1257.3369 1273.9253 1280.5224 1291.6643 1307.2861 1339.4367 1371.7731 1373.3208 1388.2130 1396.4275 1436.5434 1444.2832 1455.0827 1461.8587 1466.0923 1466.4252 1469.6698 1479.7352 1483.7507 1486.4646 1501.5081 1505.4751 1570.2111 1594.0989 1621.7245 1676.7447 2964.2198 2981.4328 2988.6882 2988.8072 2989.6952 2994.7664 3021.1230 3023.1716 3032.7581 3079.0261 3080.8961 3084.1620 3096.2894 3097.8277 3111.5957 3111.8899 3115.4422 3137.8490 3147.4180 3405.8656
redmass: 1.5926 4.5761 3.2125 4.7509 4.3170 4.4007 4.8423 4.2369 1.4533 1.5878 4.4842 3.5132 4.9176 1.0453 1.0619 3.9443 3.1921 2.5541 4.7805 3.8425 3.9325 2.7283 2.8208 2.8515 3.3279 4.1013 3.0995 4.7854 6.4640 1.1850 6.0835 11.4208 7.4920 2.2979 1.2132 5.2369 4.9834 4.7434 1.3541 3.6747 1.4496 3.1328 1.5954 1.6531 1.4357 1.4260 3.5062 1.2056 1.4773 4.8509 1.4177 3.4513 1.4408 1.7712 7.7020 3.0321 2.4374 1.1985 1.7261 1.4955 1.2011 1.9697 1.4491 1.0684 1.7387 3.0404 3.0675 1.3489 2.3143 1.5250 1.7779 1.2307 1.2314 4.2002 1.2176 4.3069 1.0475 1.1625 1.0864 1.0574 1.0566 1.0635 1.0510 1.8873 1.1590 1.1535 1.9104 7.4477 6.0511 7.0770 9.9188 1.0868 1.0597 1.0360 1.0598 1.0353 1.0363 1.0622 1.1024 1.1023 1.1047 1.0995 1.0992 1.0991 1.1005 1.0872 1.1004 1.0996 1.0963 1.0927 1.0751
irintensity: 0.4387 2.4722 0.0365 1.2323 2.1282 6.0444 4.0444 0.3744 2.1676 0.7803 5.2712 11.9712 5.1248 0.6274 0.4589 7.8289 10.6785 1.8970 0.9350 5.4818 3.1616 2.5395 6.0054 1.3897 1.5572 1.4017 1.6961 1.8919 8.4092 82.2512 1.2330 23.8668 6.5404 6.6343 7.9927 7.8732 4.9460 3.5754 28.4025 29.8025 1.7064 2.3415 0.7203 3.9411 9.1664 22.4232 62.1706 0.3288 18.5450 307.6620 0.0009 9.1139 24.2782 4.3505 212.5166 0.2528 980.9216 0.0010 109.7210 0.5257 0.0147 42.4714 0.1855 0.0044 19.9731 28.0394 15.4642 1.2654 5.6220 13.8378 14.2196 41.9715 41.4980 26.3363 45.9220 10.3909 0.3994 11.6942 11.3143 16.3754 2.0056 16.0856 4.6123 181.8574 26.6108 3.7180 248.0615 9.9237 1.7890 7.6718 335.7864 69.7427 37.5052 25.8926 25.0348 10.5958 39.9016 80.3253 13.7584 2.8701 50.9434 10.8220 20.3186 67.9310 32.1282 13.2908 4.4140 18.2491 30.9219 0.1497 6.2244
temp: 298.150 k
press: 1.00000 atm
elementType: 8 8 7 7 6 6 6 6 6 6 6 6 6 6 6 6 6 6 6 1 1 1 1 1 1 1 1 1 1 1 1 1 1 1 1 1 1 1 1
symmnumber: 1
zpe: 844837.4 jmol-1
zpe.correction: 0.321782 hartree
zpe.thermalcorrener: 0.340360 hartree
zpe.thermalcorrenthalpy: 0.341304 hartree
zpe.thermalcorrgfe: 0.273920 hartree
zpe.sumelectzpe: -842.119081 hartree
zpe.sumelectthermal: -842.100502 hartree
zpe.sumelectthermalent: -842.099558 hartree
zpe.sumelectthermalfe: -842.166942 hartree
dipole: -0.0395 2.7086 0.0016
dipole: 2.7089
quadrupole: -81.9112 -107.3034 -115.1431
quadrupole: -4.6686 -0.0106 -0.0016
quadrupole: 19.5413 -5.8508 -13.6905 -4.6686 -0.0106 -0.0016
hfenergy: -842.4408622 hartree
pointgroup: C01[X(C15H20N2O2)]
dipole: 0.0174119 1.0656248 -0.0013103 debye
polarizability: 351.3661541|-5.8555628|181.8082508|0.7290047|-0.0870931|109.0757031 unknown
InChI: InChI=1S/C15H20N2O2/c1-15(2,3)19-14(18)17-16-10-11-7-8-12-5-4-6-13(12)9-11/h7-10,17H,4-6H2,1-3H3
charge 0 multiplicity 1
39 atoms
O  4.106719 0.483267 0.007281
O  2.775568 -1.49061 0.005358
N  0.558992 0.304547 -0.00254
N  1.880216 0.70312 0.001519
C  -5.860316 -1.699399 -0.023616
C  -4.327349 -2.032617 -0.015084
C  -5.997185 -0.135861 -0.022376
C  -3.627939 -0.681714 -0.014691
C  -4.568838 0.383807 -0.018786
C  -2.247676 -0.421598 -0.010608
C  -4.122711 1.722705 -0.018788
C  -1.787669 0.92784 -0.010665
C  -2.73594 1.990049 -0.014774
C  5.443518 -0.246519 0.009979
C  5.565636 -1.09361 -1.272617
C  6.442669 0.923485 0.011602
C  5.560573 -1.092951 1.29347
C  -0.356645 1.252674 -0.006502
C  2.907429 -0.248993 0.00594
H  -6.359485 -2.134939 0.859228
H  -6.348697 -2.13224 -0.913798
H  -4.034969 -2.632524 -0.89768
H  -4.043884 -2.628175 0.873373
H  -6.556403 0.224139 0.862708
H  -6.552811 0.225868 -0.908994
H  -1.506655 -1.228105 -0.007367
H  -4.841523 2.550401 -0.0219
H  -2.379768 3.02836 -0.014808
H  6.576969 -1.536814 -1.324735
H  5.419784 -0.462607 -2.167418
H  4.822842 -1.906575 -1.282348
H  6.302025 1.553058 0.907067
H  6.30559 1.55255 -0.884772
H  7.476364 0.534135 0.013759
H  4.817313 -1.905518 1.300868
H  5.41176 -0.461392 2.187387
H  6.571482 -1.536624 1.34948
H  -0.091657 2.330702 -0.006722
H  2.160068 1.694877 0.001467
