program: Gaussian 09
title: 000292375
version: EM64L-G09RevD.01
frameworkgroup: C1[X(C17H29N3O)]
method: RPBEPBE
basis: SDD
operation: Freq
keyword: #p
keyword: freq=noraman
keyword: PBEPBE/SDD
title: #p freq=noraman PBEPBE/SDD
converged: YES YES NO NO
title: Mulliken charges:
elementType: O N N N C C C C C C C C C C C C C C C C C H H H H H H H H H H H H H H H H H H H H H H H H H H H H H
charge: -0.175511 -0.268126 -0.031199 -0.003464 -0.363521 -0.385218 -0.397296 -0.382438 -0.493775 0.203144 -0.371760 -0.502236 -0.414324 0.188687 -0.669963 -0.397254 -0.354320 -0.485044 0.182990 -0.356163 -0.696137 0.198798 0.193520 0.196786 0.193766 0.202255 0.221173 0.193075 0.193507 0.214356 0.232859 0.190156 0.190474 0.231983 0.267829 0.221567 0.206731 0.280584 0.274661 0.209421 0.207247 0.188224 0.188087 0.216845 0.233330 0.195247 0.195116 0.209749 0.215904 0.209677
chargesum: 0.00000
title: Mulliken charges with hydrogens summed into heavy atoms:
elementType: O N N N C C C C C C C C C C C C C C C C C
charge: -0.175511 -0.268126 -0.031199 -0.003464 0.028797 0.005334 0.026133 0.004144 -0.046560 0.203144 0.008870 -0.002424 0.013974 0.188687 -0.114718 0.019414 0.021990 -0.034870 0.182990 0.034201 -0.060807
polarizability: 2.96046166e+02 1.16242334e+01 1.85466589e+02 2.20562878e+01 -6.46845246e+00 1.62740502e+02
1716.lowfreq: -17.5387 -2.2470 -0.0016 -0.0009 0.0012 6.3753 13.1626 16.9246 25.8781
frequency: -12.0109 16.2274 24.8135 28.7690 40.2983 61.3808 66.4587 77.2084 88.4255 108.3310 122.8667 129.1293 134.3846 142.4999 145.7977 152.0587 203.8372 227.6041 233.7634 263.2424 288.1756 299.7083 325.6900 343.4168 372.4634 413.0791 439.1127 443.0917 472.0317 487.7849 516.7552 532.1897 555.6041 588.7608 625.9286 715.6938 718.6666 722.9237 734.0613 754.7114 764.2264 811.7486 817.1739 834.6266 874.1051 888.0312 888.7939 898.0896 900.8623 910.6988 920.4525 952.1828 967.5945 989.0391 992.2927 1011.6434 1031.1640 1036.1004 1048.6254 1065.3764 1069.2964 1078.4719 1080.2841 1087.5768 1093.5660 1103.9202 1116.7936 1123.1230 1135.3374 1146.0049 1173.4653 1182.1130 1188.9913 1209.1209 1215.8920 1240.1242 1246.2826 1247.3169 1256.5083 1271.9179 1279.7030 1280.2736 1283.4223 1288.2504 1294.4779 1296.4983 1311.0372 1326.6960 1331.3329 1335.0543 1336.2517 1348.3233 1350.1674 1355.3613 1356.6024 1373.0547 1389.4250 1405.4149 1447.2526 1451.3429 1455.4559 1459.3587 1459.9599 1463.2723 1464.4721 1466.1621 1472.2329 1474.1576 1477.2397 1478.6332 1484.3783 1487.9741 1565.7998 1631.3375 1675.9931 2950.4724 2951.2501 2953.3448 2956.5661 2962.2730 2966.5442 2968.5070 2971.7922 2971.8981 2973.3664 2981.6446 2982.9967 2983.7746 2985.9301 2989.6907 2998.5278 3009.8692 3014.6256 3022.3953 3027.4757 3033.0089 3041.7867 3046.8490 3053.7708 3058.3947 3067.5859 3068.0454 3068.6313 3070.8720
redmass: 1.8977 3.3508 3.5411 4.5749 3.2609 1.9275 3.9643 3.0708 2.6339 1.7872 3.3957 2.9764 2.6701 1.9323 2.6118 3.6221 3.7482 1.1242 2.9013 4.1761 3.3542 2.1525 4.8382 2.9611 3.5404 5.0766 2.4264 2.6535 3.0508 3.1868 3.0416 4.1209 3.4682 4.6032 5.4892 2.7932 1.0604 1.0756 1.1201 2.5191 1.4764 1.2829 1.5142 3.3286 1.3760 2.0445 2.4686 2.8086 2.0405 2.4166 2.1889 1.3493 3.1373 4.4022 4.1163 1.2081 3.6991 3.2470 3.0697 2.4167 2.1815 2.1605 2.2720 1.5363 1.8553 1.9094 2.0935 2.1267 3.1738 1.2603 1.5588 1.8078 1.6043 1.2769 1.4768 1.3014 1.3297 1.3579 1.3372 1.3237 1.4659 1.0666 1.4803 1.0920 1.1466 1.1053 1.3403 1.2790 1.6416 1.4455 1.4905 1.5636 1.5930 1.6682 1.6197 4.4094 1.2171 1.1260 1.1027 1.0967 1.0811 1.0732 1.0763 1.0650 1.0880 1.0802 1.0814 1.0908 1.0433 1.0843 1.0907 1.0917 7.6707 8.2840 11.5835 1.0587 1.0587 1.0592 1.0592 1.0589 1.0615 1.0585 1.0373 1.0638 1.0617 1.0641 1.0692 1.0965 1.0604 1.0979 1.1002 1.1018 1.0623 1.1028 1.0961 1.1030 1.1036 1.0985 1.1013 1.1010 1.0994 1.1007 1.0950 1.0993
irintensity: 0.1533 0.0348 1.2490 0.2203 0.1009 0.2357 0.0355 2.2039 0.2381 0.2326 3.2042 7.8963 1.7393 0.6018 1.2969 1.8482 0.5404 0.0024 1.7170 0.2973 2.1110 5.8149 5.1917 5.7407 1.5636 1.0049 0.2948 0.9674 0.1992 1.6805 3.4072 13.0130 1.8473 4.0928 8.6430 9.7139 15.6838 0.0682 3.7696 17.3730 5.1166 2.8895 0.9754 2.0260 0.1135 5.7245 3.5562 30.1140 8.8357 14.0208 1.3917 0.4977 4.3581 0.4380 1.1406 2.4541 48.3025 4.4245 2.0121 10.5588 10.8641 0.1053 0.4323 2.1727 0.6867 14.6379 14.2493 8.2650 9.1352 0.3961 1.0823 10.0324 19.9813 20.2975 2.8879 0.7266 8.4818 10.5006 33.8214 30.0039 53.8362 0.1271 54.1681 9.4448 4.1111 0.9731 0.9187 30.1208 29.8753 2.9178 53.9316 6.6904 10.8226 1.5109 0.5349 167.3555 11.1695 16.4750 13.4821 3.4771 12.6694 0.2001 0.2926 0.3037 11.3501 0.3260 2.5631 9.8465 12.1629 1.9911 5.0909 30.6696 4.3860 116.5539 327.7996 0.0130 0.3469 1.3418 0.3349 40.2592 7.0475 115.6341 43.5468 39.5336 111.8947 32.1562 11.0550 0.4408 38.4733 0.9546 0.7052 1.0268 0.8834 1.4220 41.1861 4.9466 148.6693 54.5034 47.2560 73.2241 0.7779 98.5217 20.3189 54.4787
temp: 298.150 k
press: 1.00000 atm
elementType: 8 7 7 7 6 6 6 6 6 6 6 6 6 6 6 6 6 6 6 6 6 1 1 1 1 1 1 1 1 1 1 1 1 1 1 1 1 1 1 1 1 1 1 1 1 1 1 1 1 1
symmnumber: 1
zpe: 1142279.0 jmol-1
zpe.correction: 0.435071 hartree
zpe.thermalcorrener: 0.457713 hartree
zpe.thermalcorrenthalpy: 0.458657 hartree
zpe.thermalcorrgfe: 0.379757 hartree
zpe.sumelectzpe: -903.008930 hartree
zpe.sumelectthermal: -902.986288 hartree
zpe.sumelectthermalent: -902.985344 hartree
zpe.sumelectthermalfe: -903.064244 hartree
dipole: 3.1743 -2.5242 2.0787
dipole: 4.5573
quadrupole: -133.1729 -133.3307 -129.5486
quadrupole: 21.7630 -7.1046 6.4592
quadrupole: -1.1555 -1.3133 2.4688 21.7630 -7.1046 6.4592
hfenergy: -903.4440009 hartree
pointgroup: C01 [X(C17H29N3O1)]
dipole: -1.2784757 -0.6733283 -1.0615657 debye
polarizability: 295.4816184|-20.4223049|180.7418264|16.4280221|11.5679012|168.0298117 unknown
InChI: InChI=1S/C17H29N3O/c1-2-3-4-5-6-7-8-11-15-14-17(21)20(19-15)16-12-9-10-13-18-16/h2-14H2,1H3
charge 0 multiplicity 1
50 atoms
O  3.811232 2.264068 1.368444
N  3.195424 0.324132 0.06874
N  2.048007 -0.099847 -0.684146
N  5.220608 -0.342985 1.024795
C  -2.780649 0.322083 -0.797349
C  -3.926711 0.156903 0.226265
C  -1.399245 0.493339 -0.127928
C  -5.315536 -0.012435 -0.430079
C  -0.250967 0.646449 -1.165492
C  1.100047 0.808996 -0.52744
C  -6.455626 -0.1882 0.598765
C  4.439724 -1.514502 -1.087409
C  5.567843 -2.541868 -0.841978
C  4.360201 -0.514513 0.065586
C  1.53789 1.957278 0.352436
C  6.828345 -1.827723 -0.307702
C  -7.847985 -0.357242 -0.049887
C  6.48788 -1.110817 1.019157
C  2.99408 1.590169 0.706544
C  -8.984195 -0.537907 0.983201
C  -10.37271 -0.705891 0.329132
H  -2.757011 -0.561778 -1.468022
H  -2.988611 1.199883 -1.444432
H  -3.717035 -0.722293 0.870523
H  -3.94632 1.038506 0.900737
H  -1.424626 1.380634 0.537014
H  -1.187479 -0.382365 0.517144
H  -5.530825 0.869909 -1.068489
H  -5.296476 -0.890365 -1.109237
H  -0.46927 1.525628 -1.806435
H  -0.2231 -0.242392 -1.822503
H  -6.473012 0.688782 1.279443
H  -6.239328 -1.071131 1.236176
H  4.61388 -0.95371 -2.028131
H  3.459815 -2.006406 -1.20892
H  5.783873 -3.090549 -1.776663
H  5.229549 -3.289382 -0.096953
H  0.9371 2.052486 1.275465
H  1.501478 2.93674 -0.157569
H  7.173452 -1.085062 -1.054684
H  7.657073 -2.54244 -0.146758
H  -7.832559 -1.232873 -0.73234
H  -8.068914 0.526782 -0.684235
H  6.419902 -1.847244 1.846678
H  7.290371 -0.404702 1.304271
H  -8.762166 -1.421311 1.616203
H  -8.997724 0.336984 1.664943
H  -10.393296 -1.591202 -0.334355
H  -11.166691 -0.833728 1.087831
H  -10.630804 0.177814 -0.284758
