program: Gaussian 09
title: 000292342
version: EM64L-G09RevD.01
frameworkgroup: C1[X(C17H16N2O)]
method: RPBEPBE
basis: SDD
operation: Freq
keyword: #p
keyword: freq=noraman
keyword: PBEPBE/SDD
title: #p freq=noraman PBEPBE/SDD
converged: YES YES NO NO
title: Mulliken charges:
elementType: O N N C C C C C C C C C C C C C C C C C H H H H H H H H H H H H H H H H
charge: -0.226387 0.060593 -0.413551 -0.447026 -0.552819 -0.547707 0.267795 0.251104 -0.532506 -0.390492 0.482448 -0.409255 -0.402495 0.258927 0.172130 -0.350396 -0.360509 -0.217807 -0.232309 -0.226007 0.226462 0.226212 0.233534 0.233852 0.230832 0.230724 0.291422 0.239553 0.220257 0.202418 0.286185 0.273753 0.223471 0.233675 0.230426 0.233491
chargesum: 0.00000
title: Mulliken charges with hydrogens summed into heavy atoms:
elementType: O N N C C C C C C C C C C C C C C C C C
charge: -0.226387 0.060593 -0.127366 0.005648 -0.085432 -0.086151 0.267795 0.251104 -0.241084 -0.150938 0.482448 -0.188998 -0.200077 0.258927 0.172130 -0.076643 -0.137038 0.015868 -0.001883 0.007484
polarizability: 4.16811839e+02 1.05866644e+01 1.99088311e+02 2.45747088e+00 5.51819975e+00 9.63611132e+01
1716.lowfreq: -128.0753 -5.2031 -0.0006 0.0001 0.0008 2.5994 5.3204 22.3625 33.4056
frequency: -128.0732 22.3229 33.3234 37.5500 58.5034 96.6866 109.2742 161.3885 184.3482 196.5462 211.9373 230.0274 278.0628 345.8205 357.0256 372.8033 403.4389 413.8203 430.9950 476.2362 490.4179 558.3844 559.9667 606.6042 612.7619 628.3084 669.9921 682.0500 684.0311 703.6359 708.9380 741.0962 775.8462 790.0526 798.0465 824.3692 856.7377 872.8590 895.4115 908.9829 930.0099 934.6368 937.6276 956.3974 961.9042 983.5543 989.3410 1004.9936 1016.8735 1031.5840 1035.8025 1040.6651 1084.6716 1104.8272 1120.9633 1142.4368 1159.6445 1174.0839 1190.4269 1197.0917 1199.3774 1216.2405 1237.3335 1238.8121 1253.1699 1280.0798 1291.0291 1307.1739 1316.6811 1342.6018 1383.9768 1388.9354 1433.5591 1437.2931 1455.1095 1461.2829 1475.8320 1486.1336 1489.4729 1509.9256 1566.8354 1581.5210 1592.1062 1610.1633 1621.1592 1622.3849 2953.4095 2982.0979 2988.7492 3021.9297 3023.8216 3032.8893 3079.8071 3112.8570 3119.0400 3133.0478 3138.9429 3145.7701 3148.6195 3158.8231 3170.5657 3383.0255
redmass: 1.5943 5.3399 4.0904 5.0123 4.8258 5.0677 5.2064 3.4177 3.5868 3.5121 6.2892 5.1384 4.0002 6.2550 3.9146 5.3620 2.8439 4.3443 2.9559 5.1471 4.6173 3.6892 3.9120 5.4356 5.1792 1.3565 6.4825 5.6045 5.7460 1.5635 2.2582 1.2169 4.9484 2.4961 4.1477 1.3507 1.2503 6.7482 1.4542 3.0685 1.4420 1.4463 1.4245 3.0396 1.4794 1.4772 4.7709 1.3436 4.2007 3.1003 2.8650 1.7694 1.6354 3.0208 3.0466 1.2006 1.6991 1.0584 1.1189 1.3768 1.2029 1.4441 1.0693 3.1133 1.7476 1.3448 2.3331 1.5189 1.3315 1.8126 8.8506 4.2334 2.2528 4.3217 1.1618 1.0861 2.1282 1.2540 1.8911 2.0288 6.9385 6.2888 5.8920 6.0156 7.5506 7.2783 1.0864 1.0597 1.0598 1.0622 1.1024 1.1022 1.1047 1.0872 1.0869 1.0871 1.0964 1.0921 1.0928 1.0957 1.1006 1.0750
irintensity: 0.4658 1.7052 0.5127 1.3605 2.4640 2.5249 5.9915 2.3563 2.1195 12.8623 0.3684 10.8146 6.0883 0.2784 5.4373 3.4019 0.3222 10.8638 4.1328 0.9666 4.2617 1.4997 1.2332 3.9099 6.1494 71.0634 27.1601 9.7618 4.7860 75.9412 11.1531 8.2465 5.1889 21.0571 3.2678 28.1032 1.3218 30.7440 1.6942 4.5708 8.9203 2.7205 21.7818 8.9956 18.1437 2.5600 1.8510 2.6369 1.2946 1.4942 18.9032 4.4939 58.4357 0.9973 149.8949 0.0022 24.4043 2.5314 22.9264 15.4499 0.0451 7.2848 0.3806 333.4476 53.7339 0.6841 8.3611 12.2691 1.9411 9.4805 1.7704 24.3793 3.1908 11.2122 10.2366 12.7505 50.6531 32.1097 57.9607 231.0592 16.9493 38.4330 26.7998 6.0772 110.3025 48.8266 68.3220 36.0099 23.7767 83.1162 13.4308 2.7899 50.1471 12.7509 14.4440 1.7149 30.5747 23.1497 0.3674 17.2971 26.1129 13.3260
temp: 298.150 k
press: 1.00000 atm
elementType: 8 7 7 6 6 6 6 6 6 6 6 6 6 6 6 6 6 6 6 6 1 1 1 1 1 1 1 1 1 1 1 1 1 1 1 1
symmnumber: 1
zpe: 754710.4 jmol-1
zpe.correction: 0.287454 hartree
zpe.thermalcorrener: 0.303784 hartree
zpe.thermalcorrenthalpy: 0.304728 hartree
zpe.thermalcorrgfe: 0.241267 hartree
zpe.sumelectzpe: -840.717009 hartree
zpe.sumelectthermal: -840.700679 hartree
zpe.sumelectthermalent: -840.699735 hartree
zpe.sumelectthermalfe: -840.763196 hartree
dipole: 0.1957 4.4052 -0.3357
dipole: 4.4223
quadrupole: -80.4655 -111.2350 -120.6700
quadrupole: -9.5199 1.6663 1.9339
quadrupole: 23.6580 -7.1115 -16.5465 -9.5199 1.6663 1.9339
hfenergy: -841.0044631 hartree
pointgroup: C01 [X(C17H16N2O1)]
dipole: -0.0968521 1.7336195 0.1108397 debye
polarizability: 416.9435155|-8.122841|198.7405009|5.4989324|-6.766803|96.5772467 unknown
InChI: InChI=1S/C17H16N2O/c20-17(15-5-2-1-3-6-15)19-18-12-13-9-10-14-7-4-8-16(14)11-13/h1-3,5-6,9-12,19H,4,7-8H2
charge 0 multiplicity 1
36 atoms
O  2.256306 -1.964648 0.036556
N  0.251309 0.005934 0.046387
N  1.603777 0.291702 0.096576
C  -6.312202 -1.424329 -0.244447
C  -4.812852 -1.885299 -0.278509
C  -6.316129 0.132507 -0.04898
C  -4.002036 -0.610862 -0.100407
C  -4.849511 0.523423 0.028916
C  -2.605299 -0.472483 -0.056819
C  -4.292935 1.808629 0.203933
C  -2.034437 0.822218 0.1192
C  -2.889178 1.953723 0.248596
C  -0.581847 1.019608 0.169923
C  3.988609 -0.257827 0.018805
C  2.559899 -0.741176 0.040775
C  4.982439 -1.152443 0.493596
C  4.382338 1.010464 -0.486391
C  6.341153 -0.776552 0.491844
C  5.74449 1.3838 -0.492126
C  6.72608 0.495246 0.003904
H  -6.854429 -1.921458 0.578403
H  -6.827119 -1.701258 -1.180589
H  -4.561271 -2.387218 -1.231925
H  -4.590825 -2.613788 0.524123
H  -6.858373 0.427439 0.870057
H  -6.823408 0.647816 -0.887349
H  -1.934163 -1.332481 -0.153918
H  -4.939927 2.687756 0.304621
H  -2.446984 2.94911 0.384642
H  -0.227891 2.062742 0.314051
H  1.926892 1.260051 0.242567
H  4.663167 -2.137458 0.849359
H  3.643943 1.695048 -0.922056
H  7.099926 -1.47218 0.866376
H  6.040913 2.358686 -0.894497
H  7.782274 0.78646 -0.000997
