program: Gaussian 09
title: 000292388
version: EM64L-G09RevD.01
frameworkgroup: C1[X(C20H12Cl2O4)]
method: RPBEPBE
basis: SDD
operation: Freq
keyword: #p
keyword: freq=noraman
keyword: PBEPBE/SDD
title: #p freq=noraman PBEPBE/SDD
converged: YES YES NO NO
title: Mulliken charges:
elementType: Cl Cl O O O O C C C C C C C C C C C C C C C C C C C C H H H H H H H H H H H H
charge: -0.008042 -0.043608 -0.266583 -0.248438 -0.411638 -0.248785 0.341513 0.207576 0.202128 0.200787 0.226218 -0.507362 -0.316489 -0.337927 -0.509667 -0.522260 -0.437563 0.323982 -0.362263 0.155362 0.495779 -0.300479 -0.300074 -0.195192 -0.227747 -0.107478 0.236431 0.240746 0.261886 0.218675 0.294090 0.285140 0.230658 0.254934 0.266021 0.283765 0.259932 0.365972
chargesum: 0.00000
title: Mulliken charges with hydrogens summed into heavy atoms:
elementType: Cl Cl O O O O C C C C C C C C C C C C C C C C C C C C
charge: -0.008042 -0.043608 -0.266583 -0.248438 -0.045666 -0.248785 0.341513 0.207576 0.202128 0.200787 0.226218 -0.030186 -0.054602 -0.119252 -0.215577 -0.237120 -0.206905 0.323982 -0.107329 0.155362 0.495779 -0.300479 -0.034053 0.088574 0.032184 -0.107478
polarizability: 3.58014609e+02 5.36357172e+01 3.84812113e+02 -3.51629434e+01 -2.46184275e-01 1.51356347e+02
1716.lowfreq: -3.3061 -0.0014 0.0011 0.0013 2.2288 3.8888 14.1996 15.9848 30.5352
frequency: 14.1958 15.9411 30.4941 56.2042 73.5074 77.4732 92.5959 114.7409 138.7545 164.6880 172.9933 178.1379 195.4524 225.3453 252.1432 284.2388 299.2333 310.5269 327.6080 332.6708 349.9084 367.6860 384.3017 392.6939 414.8016 425.5312 439.5399 451.9179 469.8135 483.0653 525.6781 545.4153 548.0445 574.8902 579.6029 610.5255 611.4399 630.7571 645.6185 681.8957 698.9900 711.8711 722.4929 739.0423 748.2695 766.5176 793.5940 796.8124 804.0791 817.6580 855.6752 865.0301 866.2917 874.0107 896.0121 926.2569 927.5331 944.9993 957.5372 971.2177 1029.9247 1034.5873 1044.4405 1086.0548 1095.1947 1110.0817 1144.3379 1150.3535 1168.3241 1191.0782 1205.9136 1218.7038 1226.1789 1248.7358 1255.3207 1287.9042 1296.8504 1329.4062 1354.1344 1366.3175 1381.0296 1384.8390 1388.9395 1430.1199 1448.5791 1459.9878 1490.5888 1500.6996 1510.9176 1555.5995 1563.0740 1569.5742 1582.8293 1593.5534 1617.3409 1653.8298 2967.8948 3063.0055 3132.8181 3140.1064 3161.1736 3166.7070 3179.5082 3179.6695 3180.2406 3182.8769 3193.4411 3581.9747
redmass: 10.9278 10.6563 8.3262 7.0231 5.9520 6.0231 8.3333 9.7062 8.3125 6.0329 6.3816 10.2677 7.5638 7.5215 6.6075 4.7626 4.9465 5.7811 7.1498 8.3270 5.0086 11.3025 1.1291 10.0267 5.3146 3.1070 3.2495 3.0685 5.5469 5.3772 4.4688 5.6905 4.1449 7.7152 8.7377 5.1979 4.7393 4.0275 5.1175 6.7682 3.9070 7.1962 3.7051 7.6331 4.1467 3.8512 1.8565 1.5166 1.8810 2.9614 4.0515 1.3876 1.5379 1.6651 3.5391 1.3471 1.4597 5.6065 3.2713 1.3316 4.0293 1.9255 4.1421 2.5192 2.6846 2.0350 1.4681 1.3226 1.3528 2.0418 1.2202 1.7894 1.9865 2.1265 1.4072 1.9277 3.4486 2.6287 2.4778 1.9470 3.9432 2.3308 4.4813 7.2224 4.3128 2.5400 1.7766 1.8206 5.1237 6.8410 8.3342 7.6250 7.4958 7.6108 6.7129 7.6790 1.0655 1.0953 1.0903 1.0860 1.0877 1.0978 1.0929 1.0940 1.0958 1.0944 1.0935 1.0662
irintensity: 0.9368 1.2571 1.7082 0.3323 1.7633 1.0817 0.4677 0.7757 3.7242 0.0669 3.4638 1.3856 0.4338 0.1100 0.0211 2.4161 2.0376 1.1627 5.1446 2.0325 13.9863 6.8420 136.0431 3.2115 0.7100 9.4458 4.3180 3.3328 7.4964 6.7621 20.4559 8.2668 6.3410 0.6543 5.3526 7.2983 6.7990 24.5130 19.7858 13.7419 1.1511 41.4703 3.7950 2.8663 1.4557 31.8790 39.6573 51.4168 7.5533 2.9304 5.5391 20.6420 19.0851 72.8381 15.9416 0.2714 7.7636 92.7961 37.0765 1.0748 89.7216 29.6815 16.4984 51.6105 242.8382 32.8473 114.1031 4.2364 2.7257 28.0885 23.5521 145.2054 161.1796 16.5852 76.3178 88.6331 18.9220 13.7813 13.0526 47.0917 121.6044 31.6112 6.1933 4.9800 14.9934 308.9130 76.8492 79.2033 198.5047 34.9126 100.6662 25.5147 67.0532 5.7968 511.8964 41.2975 27.7261 12.1332 12.8115 7.5541 9.2493 18.3987 0.3032 5.5947 1.1119 2.2752 1.5240 117.1879
temp: 298.150 k
press: 1.00000 atm
elementType: 17 17 8 8 8 8 6 6 6 6 6 6 6 6 6 6 6 6 6 6 6 6 6 6 6 6 1 1 1 1 1 1 1 1 1 1 1 1
symmnumber: 1
zpe: 695501.2 jmol-1
zpe.correction: 0.264902 hartree
zpe.thermalcorrener: 0.286854 hartree
zpe.thermalcorrenthalpy: 0.287799 hartree
zpe.thermalcorrgfe: 0.211135 hartree
zpe.sumelectzpe: -1988.516673 hartree
zpe.sumelectthermal: -1988.494721 hartree
zpe.sumelectthermalent: -1988.493777 hartree
zpe.sumelectthermalfe: -1988.570440 hartree
dipole: 4.8694 5.6575 -4.0707
dipole: 8.5023
quadrupole: -208.0297 -158.9952 -161.8650
quadrupole: -26.4673 1.4456 4.0137
quadrupole: -31.7331 17.3014 14.4316 -26.4673 1.4456 4.0137
hfenergy: -1988.7815753 hartree
pointgroup: C01 [X(C20H12Cl2O4)]
dipole: -2.2512472 1.919715 1.5607778 debye
polarizability: 375.1203446|-54.7782759|369.5861948|-29.2238142|-3.7609973|149.4765301 unknown
InChI: InChI=1S/C20H12Cl2O4/c21-11-1-6-18(17(22)7-11)25-10-16-14-4-2-12(23)8-19(14)26-20-9-13(24)3-5-15(16)20/h1-9,23H,10H2
charge 0 multiplicity 1
38 atoms
Cl -3.107341 0.586975 -2.562245
Cl -7.371785 -1.706622 0.156497
O  3.395171 0.913456 -0.077191
O  -1.507946 -0.334003 -0.256072
O  1.900872 5.417639 0.253545
O  5.227796 -3.483313 -0.561498
C  0.799023 -0.168388 0.45962
C  1.007244 1.26964 0.412925
C  1.870144 -1.036377 0.19724
C  2.319977 1.775362 0.14471
C  3.203203 -0.487837 -0.074293
C  -0.570459 -0.682637 0.840168
C  -0.023688 2.235341 0.614572
C  1.776784 -2.490707 0.167636
C  2.612914 3.146089 0.095872
C  4.312713 -1.26221 -0.323433
C  0.240696 3.610078 0.570194
C  1.566248 4.063986 0.311828
C  2.869468 -3.286068 -0.085955
C  4.217446 -2.723495 -0.33926
C  -2.850912 -0.684681 -0.08344
C  -3.743886 -0.309915 -1.123978
C  -3.371957 -1.37734 1.038517
C  -5.113644 -0.615722 -1.061305
C  -4.74725 -1.691875 1.117653
C  -5.598386 -1.307988 0.067614
H  -0.915876 -0.196383 1.776216
H  -0.576833 -1.774024 0.995391
H  -1.050498 1.8979 0.77431
H  0.803672 -2.964383 0.328799
H  3.628024 3.492342 -0.108039
H  5.284406 -0.799219 -0.514622
H  -0.571391 4.331476 0.720469
H  2.786275 -4.378013 -0.117083
H  -2.716136 -1.681839 1.85847
H  -5.782329 -0.320187 -1.873423
H  -5.141529 -2.227918 1.985038
H  1.109971 5.993955 0.400652
