program: Gaussian 09
title: 000292351
version: EM64L-G09RevD.01
frameworkgroup: C1[X(C15H12N2O4)]
method: RPBEPBE
basis: SDD
operation: Freq
keyword: #p
keyword: freq=noraman
keyword: PBEPBE/SDD
title: #p freq=noraman PBEPBE/SDD
converged: YES YES NO NO
title: Mulliken charges:
elementType: O O O O N N C C C C C C C C C C C C C C C H H H H H H H H H H H H
charge: -0.276156 -0.254696 -0.206577 -0.208847 -0.475842 0.017033 -0.654144 0.532955 0.299171 0.176146 0.149265 -0.593011 -0.359141 0.427737 -0.325530 -0.340197 -0.172677 -0.391445 -0.243466 -0.222717 -0.215432 0.279964 0.280545 0.384545 0.293635 0.317965 0.253033 0.282479 0.238452 0.286291 0.238493 0.241308 0.240861
chargesum: 0.00000
title: Mulliken charges with hydrogens summed into heavy atoms:
elementType: O O O O N N C C C C C C C C C C C C C C C
charge: -0.276156 -0.254696 -0.206577 -0.208847 -0.091297 0.017033 -0.093635 0.532955 0.299171 0.176146 0.149265 -0.299376 -0.041176 0.427737 -0.072498 -0.057718 0.065774 -0.105153 -0.004973 0.018591 0.025429
polarizability: 3.17591463e+02 -8.01710070e+00 2.12725336e+02 -2.83455776e-01 -9.43612031e-03 7.53665385e+01
1716.lowfreq: -5.0531 -0.7163 -0.0006 -0.0004 0.0004 4.4787 19.6162 29.3116 47.6943
frequency: 19.2518 29.2594 47.6910 50.7602 56.5564 86.7721 100.8452 127.1152 156.9649 170.9406 173.9634 221.5483 269.1905 306.4901 324.8270 380.2048 397.6177 401.4284 403.6440 428.1060 443.2926 508.3214 508.9822 539.7198 550.5817 612.8179 636.8028 638.3683 656.3830 687.4476 694.4465 702.0830 707.8721 773.5923 776.6738 811.8370 820.5008 859.9670 876.5393 895.8525 926.3311 949.0211 949.4261 953.9662 970.4493 984.6602 989.7186 995.8802 1008.8663 1009.0264 1015.5619 1028.9064 1085.4458 1089.8698 1091.2124 1175.2410 1177.2243 1192.4431 1202.8121 1205.1398 1216.8678 1238.3184 1269.5423 1310.8721 1314.6380 1330.9819 1371.4947 1389.2339 1391.1286 1408.9707 1437.2519 1439.8709 1481.7739 1483.9724 1536.4276 1560.1379 1589.8007 1593.2710 1610.0824 1622.2712 1639.2763 2994.7444 3041.5698 3135.3324 3144.6643 3153.0620 3154.8968 3163.5061 3164.3598 3174.5215 3189.6353 3195.0468 3203.0727
redmass: 5.0561 4.7632 7.8442 9.6117 10.2359 3.8175 3.8201 6.4285 4.7647 7.5721 5.3313 8.1643 4.1597 8.7444 6.6301 9.5847 2.8854 8.7698 2.9296 3.3409 8.4387 3.3783 5.3113 6.4313 4.1946 6.4478 4.7690 6.5138 7.5555 2.2612 1.8042 7.1512 6.1540 1.7194 7.5270 6.5583 1.3893 1.2519 5.4949 1.4218 1.7542 4.0850 1.5282 1.3375 1.7704 6.1307 6.2233 1.3843 3.5463 1.3382 1.3511 1.9878 1.7728 1.6340 1.5997 1.1463 1.0725 1.1738 1.1246 3.2419 5.2380 3.1026 1.7154 1.8310 1.6287 1.7396 9.5932 6.0267 8.1114 1.1300 2.4345 3.2967 2.2103 2.8915 3.7093 4.3290 5.9203 7.1155 5.8727 6.7628 2.5799 1.0616 1.0956 1.0856 1.0882 1.0897 1.0925 1.0923 1.0964 1.1013 1.0930 1.0975 1.0829
irintensity: 0.0182 0.1180 0.2744 2.2340 3.2455 14.0470 1.7296 1.8512 0.2487 14.8773 0.6589 2.0466 0.0018 5.8708 16.8144 5.7255 0.3051 2.3005 0.2414 0.7276 0.7670 12.1908 21.6167 36.0428 0.6758 0.2688 6.2996 21.3160 13.4083 20.8187 54.7231 9.9686 17.8896 52.8911 11.2937 9.2332 48.6661 0.4482 7.9280 3.1593 9.5455 18.7946 43.8656 28.7564 34.7834 5.3130 5.2632 0.6266 32.8854 3.8648 0.0106 0.8187 18.5975 20.6590 14.5358 19.0373 3.1187 44.8260 3.0484 21.7908 310.9065 110.6030 28.6466 80.3354 36.3422 118.9737 135.8982 48.1650 1.5320 44.2041 33.0275 25.4538 4.5230 95.1721 919.1060 79.5726 82.8124 113.3057 7.6621 30.1095 178.1250 12.5474 0.3743 0.1078 4.2187 14.9549 11.8478 6.5689 12.7275 30.2808 11.0450 3.5550 751.0288
temp: 298.150 k
press: 1.00000 atm
elementType: 8 8 8 8 7 7 6 6 6 6 6 6 6 6 6 6 6 6 6 6 6 1 1 1 1 1 1 1 1 1 1 1 1
symmnumber: 1
zpe: 638848.1 jmol-1
zpe.correction: 0.243324 hartree
zpe.thermalcorrener: 0.261178 hartree
zpe.thermalcorrenthalpy: 0.262123 hartree
zpe.thermalcorrgfe: 0.194403 hartree
zpe.sumelectzpe: -987.662209 hartree
zpe.sumelectthermal: -987.644355 hartree
zpe.sumelectthermalent: -987.643411 hartree
zpe.sumelectthermalfe: -987.711130 hartree
dipole: -8.4141 2.2438 -0.0078
dipole: 8.7082
quadrupole: -104.7286 -132.0748 -123.5266
quadrupole: 20.8920 -0.1465 0.2499
quadrupole: 15.3814 -11.9648 -3.4166 20.8920 -0.1465 0.2499
hfenergy: -987.9055331 hartree
pointgroup: C01 [X(C15H12N2O4)]
dipole: -3.2891551 -0.6939337 -0.6616195 debye
polarizability: 316.0271697|-0.4870273|179.6411948|20.1667295|58.5830018|110.0149729 unknown
InChI: InChI=1S/C15H12N2O4/c18-14(11-5-2-1-3-6-11)10-15(19)16-12-7-4-8-13(9-12)17(20)21/h1-9,16H,10H2
charge 0 multiplicity 1
33 atoms
O  -1.425132 1.003721 0.399177
O  0.092618 -2.546404 -1.448363
O  6.097509 1.449245 1.309634
O  4.091194 2.468537 1.67196
N  0.631461 -0.557915 -0.306489
N  4.811046 1.49894 1.21277
C  -1.744504 -1.100203 -0.8265
C  2.04315 -0.647237 -0.221546
C  -3.705077 0.438467 -0.093034
C  -2.235139 0.175109 -0.133677
C  -0.243448 -1.46152 -0.882863
C  2.717221 0.420541 0.424172
C  2.795445 -1.738905 -0.744493
C  4.119364 0.374257 0.533028
C  -4.656596 -0.441098 -0.68148
C  -4.159352 1.617292 0.562649
C  4.201077 -1.746569 -0.61471
C  4.888445 -0.694897 0.02397
C  -6.033254 -0.144611 -0.613883
C  -5.534407 1.91013 0.629393
C  -6.474909 1.029427 0.040912
H  -2.248754 -1.974384 -0.370452
H  -2.094709 -1.091472 -1.877779
H  0.163056 0.272796 0.112153
H  2.176727 1.277004 0.839255
H  2.26691 -2.555766 -1.239193
H  -4.33337 -1.354168 -1.191747
H  -3.413143 2.282021 1.009494
H  4.766364 -2.591526 -1.021027
H  5.975147 -0.684022 0.133935
H  -6.761372 -0.824428 -1.068536
H  -5.876763 2.818401 1.13613
H  -7.545403 1.256639 0.092443
