program: Gaussian 09
title: 000292356
version: EM64L-G09RevD.01
frameworkgroup: C1[X(C17H19Cl2N3)]
method: RPBEPBE
basis: SDD
operation: Freq
keyword: #p
keyword: freq=noraman
keyword: PBEPBE/SDD
title: #p freq=noraman PBEPBE/SDD
converged: YES YES NO NO
title: Mulliken charges:
elementType: Cl Cl N N N C C C C C C C C C C C C C C C C C H H H H H H H H H H H H H H H H H H H
charge: -0.030109 -0.066329 -0.124551 -0.108374 -0.111124 -0.454535 -0.339053 -0.334345 0.423385 -0.665876 -0.691245 -0.348306 -0.311930 -0.362471 -0.314327 0.142541 0.301786 -0.294627 -0.247353 -0.078909 -0.195289 -0.240411 0.222085 0.228452 0.197679 0.224156 0.198042 0.192105 0.240784 0.241470 0.233036 0.211788 0.220457 0.216185 0.242706 0.231290 0.248341 0.282112 0.302057 0.258530 0.260175
chargesum: 0.00000
title: Mulliken charges with hydrogens summed into heavy atoms:
elementType: Cl Cl N N N C C C C C C C C C C C C C C C C C
charge: -0.030109 -0.066329 -0.124551 -0.108374 -0.111124 -0.003998 0.082782 0.055802 0.423385 0.049415 -0.042815 -0.105600 -0.080639 -0.114129 -0.032215 0.142541 0.301786 -0.294627 0.054705 -0.078909 0.063241 0.019764
polarizability: 5.77036167e+02 -4.12328093e+01 2.51899857e+02 -1.96182868e+01 -1.12070600e+01 1.13951628e+02
1716.lowfreq: -7.2666 0.0012 0.0014 0.0016 0.7266 6.8578 10.5265 19.5063 38.7267
frequency: 9.8419 19.2180 38.7193 41.9548 48.9322 65.7608 86.9468 96.9450 109.4047 125.3932 143.0203 158.1801 171.0660 181.4901 226.8676 230.9194 238.9849 245.8170 270.0469 305.2891 308.8804 316.2342 376.3846 384.1737 410.7040 420.6191 438.9936 458.5231 466.6751 502.4012 526.5994 542.4433 572.3664 579.2966 620.6938 634.5261 693.1488 716.4738 737.4696 745.0755 746.5159 792.0606 801.9854 805.3696 832.5494 846.6291 898.6613 908.4583 913.7512 918.4678 938.0830 953.2915 964.4097 986.2862 987.4191 1013.6719 1019.1913 1063.5733 1069.9601 1079.8616 1106.0152 1111.1755 1121.5037 1127.1137 1158.3205 1167.4908 1182.8690 1214.4236 1225.6259 1238.7427 1265.1318 1267.2051 1284.2010 1288.7747 1307.7082 1328.1969 1342.6449 1354.6021 1356.1698 1378.1176 1382.3251 1391.7851 1394.0828 1438.4372 1446.0719 1462.4461 1469.9634 1473.9570 1475.7540 1478.7894 1486.7632 1494.2744 1503.6104 1519.5674 1546.8157 1549.7917 1584.1864 1624.7186 2956.4307 2963.2362 2977.0709 2979.0806 2995.3763 3005.7743 3026.7134 3032.4665 3057.7713 3074.0703 3076.9308 3103.7582 3147.8539 3149.6571 3163.8335 3169.4505 3170.0913 3175.8672 3183.9808
redmass: 6.5716 4.2237 4.3594 4.9144 4.2826 1.6610 5.9752 5.3298 3.1297 3.5069 4.4610 7.9146 2.2497 1.8789 7.1855 1.5778 1.7449 4.9463 3.9469 7.1146 13.8152 5.1615 3.8508 4.6643 3.5642 3.7772 3.4696 3.4319 5.0602 3.6927 2.5875 4.8551 7.1272 4.3330 6.2455 7.0169 6.1318 4.1148 1.0755 4.9220 4.4997 1.1776 1.3489 1.2653 1.7539 6.9326 1.7800 7.6029 1.4287 1.4547 1.3426 2.1598 1.3542 2.4968 1.4186 3.8082 6.8742 1.7466 2.5382 1.6417 1.3955 2.0289 1.6970 1.5682 1.6707 1.8683 1.6646 1.6922 1.4988 1.9298 2.5541 1.3040 1.1395 1.2043 1.5094 4.6656 1.4366 2.9668 1.7543 5.2211 2.4417 4.0794 1.2753 2.3948 1.2773 2.7987 1.0897 1.0530 1.1088 1.0448 1.0942 1.1414 1.3479 2.0984 5.7114 6.8982 8.6747 6.3532 1.0375 1.0591 1.0382 1.0579 1.0616 1.0975 1.1009 1.1010 1.1049 1.1008 1.0995 1.0964 1.0883 1.0868 1.0887 1.0955 1.0915 1.0953 1.0976
irintensity: 0.0250 0.0991 1.1600 0.6558 0.6776 0.1929 0.5359 0.0575 0.0782 0.9581 0.1787 0.2455 0.1418 2.2361 0.3398 1.1611 1.4100 0.8479 4.1666 1.2582 0.2402 1.0709 0.5456 0.9429 6.8160 9.7753 1.4815 10.4652 29.0650 3.9270 26.0749 14.1616 26.3843 0.4767 3.0718 2.8043 21.5369 0.2620 9.6119 2.6621 2.1992 1.4767 47.1345 1.8220 69.7842 68.3251 10.7937 46.0369 19.7277 28.9885 2.5173 22.2528 2.0821 0.6493 2.0176 8.2972 82.6762 29.0490 0.2780 24.0105 6.5359 36.3662 3.5828 22.0339 174.5647 3.0155 110.5983 26.3179 16.0609 19.6409 14.9990 2.2591 16.8730 61.3281 120.2385 658.6689 0.9016 11.0752 38.3770 0.7170 97.6137 76.4031 17.2737 94.1366 28.3327 9.8724 1.0328 13.8086 2.6732 11.2777 14.4482 23.3646 22.4072 123.5014 35.4000 87.3024 32.4897 646.4199 120.4962 27.5706 28.7995 30.1346 97.5140 6.3765 32.4336 11.5394 29.4573 77.6627 55.4601 25.8533 5.5686 7.5665 2.5153 20.2189 4.8162 22.7965 3.7068
temp: 298.150 k
press: 1.00000 atm
elementType: 17 17 7 7 7 6 6 6 6 6 6 6 6 6 6 6 6 6 6 6 6 6 1 1 1 1 1 1 1 1 1 1 1 1 1 1 1 1 1 1 1
symmnumber: 1
zpe: 847945.8 jmol-1
zpe.correction: 0.322965 hartree
zpe.thermalcorrener: 0.345208 hartree
zpe.thermalcorrenthalpy: 0.346152 hartree
zpe.thermalcorrgfe: 0.267641 hartree
zpe.sumelectzpe: -1741.932332 hartree
zpe.sumelectthermal: -1741.910090 hartree
zpe.sumelectthermalent: -1741.909146 hartree
zpe.sumelectthermalfe: -1741.987657 hartree
dipole: 7.9164 -0.9278 -0.2375
dipole: 7.9741
quadrupole: -108.9687 -138.3232 -149.3121
quadrupole: -14.8130 -1.4847 0.0716
quadrupole: 23.2326 -6.1219 -17.1108 -14.8130 -1.4847 0.0716
hfenergy: -1742.2552979 hartree
pointgroup: C01 [X(C17H19Cl2N3)]
dipole: -3.1174777 -0.3504177 -0.0295975 debye
polarizability: 578.022031|40.5974005|243.6213832|-3.299949|34.2884834|121.244238 unknown
InChI: InChI=1S/C17H19Cl2N3/c1-3-4-11-22(2)15-8-6-14(7-9-15)20-21-17-12-13(18)5-10-16(17)19/h5-10,12H,3-4,11H2,1-2H3
charge 0 multiplicity 1
41 atoms
Cl 3.123863 3.14974 1.061248
Cl 6.623672 -1.92707 -0.768447
N  -4.16795 -1.305996 0.160602
N  1.466791 -0.712599 -0.068368
N  1.991668 0.448029 0.27128
C  -5.083633 -0.234902 0.608229
C  -5.529039 0.728016 -0.520678
C  -6.475348 1.834031 -0.000932
C  -2.790197 -1.121642 0.096441
C  -4.766106 -2.568655 -0.302296
C  -6.947424 2.7871 -1.120078
C  -1.92408 -2.192868 -0.309552
C  -2.178751 0.138671 0.437744
C  -0.536507 -2.014861 -0.350295
C  -0.794468 0.305545 0.397569
C  0.059577 -0.77206 0.004472
C  3.41447 0.483504 0.194043
C  4.078422 1.693972 0.539605
C  4.217786 -0.626637 -0.208616
C  5.607877 -0.49593 -0.250528
C  5.481227 1.80912 0.492002
C  6.266376 0.705241 0.093119
H  -5.978003 -0.714997 1.049407
H  -4.608501 0.337143 1.426567
H  -6.036992 0.147389 -1.316909
H  -4.636179 1.188012 -0.987409
H  -5.95908 2.417844 0.788476
H  -7.357549 1.367354 0.484102
H  -4.451867 -3.424915 0.327014
H  -4.491481 -2.792554 -1.351524
H  -5.863141 -2.490047 -0.248257
H  -7.494741 2.235132 -1.906937
H  -7.62091 3.56929 -0.725247
H  -6.088549 3.29185 -1.600279
H  -2.340097 -3.165963 -0.581814
H  -2.800365 0.990858 0.725909
H  0.124078 -2.834242 -0.653341
H  -0.333851 1.263592 0.658717
H  3.704018 -1.55493 -0.473793
H  5.95951 2.753952 0.764661
H  7.356067 0.780486 0.052195
