program: Gaussian 09
title: 000292355
version: EM64L-G09RevD.01
frameworkgroup: C1[X(C18H21Cl2N3)]
method: RPBEPBE
basis: SDD
operation: Freq
keyword: #p
keyword: freq=noraman
keyword: PBEPBE/SDD
title: #p freq=noraman PBEPBE/SDD
converged: YES YES NO NO
title: Mulliken charges:
elementType: Cl Cl N N N C C C C C C C C C C C C C C C C C C H H H H H H H H H H H H H H H H H H H H H
charge: -0.030283 -0.066891 -0.134348 -0.108119 -0.111503 -0.411959 -0.413213 0.435205 -0.354760 -0.354344 -0.324547 -0.342805 -0.674694 -0.675036 -0.316549 -0.374033 0.140475 0.301958 -0.295046 -0.248024 -0.078651 -0.195442 -0.241185 0.223602 0.219993 0.222955 0.220744 0.204433 0.231160 0.204537 0.230996 0.232250 0.233390 0.212898 0.208888 0.228133 0.227971 0.212210 0.209299 0.282143 0.247975 0.301961 0.258319 0.259939
chargesum: 0.00000
title: Mulliken charges with hydrogens summed into heavy atoms:
elementType: Cl Cl N N N C C C C C C C C C C C C C C C C C C
charge: -0.030283 -0.066891 -0.134348 -0.108119 -0.111503 0.031635 0.030486 0.435205 0.080833 0.081189 -0.092297 -0.109415 -0.024775 -0.025556 -0.034406 -0.126058 0.140475 0.301958 -0.295046 0.053936 -0.078651 0.062877 0.018754
polarizability: 6.12132376e+02 2.72927264e+00 2.60944315e+02 -5.99465400e-01 -1.44785852e+01 1.21178884e+02
1716.lowfreq: -10.0027 -3.1261 -0.0016 -0.0005 0.0003 1.0413 6.1214 24.8027 31.1823
frequency: 4.6464 24.7869 31.1765 40.2380 56.1747 64.5832 68.5454 87.8433 95.4246 110.7540 120.4560 131.2531 160.5450 193.2583 210.7399 221.5648 226.7739 233.9750 246.4101 277.2077 294.8407 304.4326 310.4077 311.2267 347.3418 382.7056 401.6630 428.5945 438.1264 457.5898 468.7037 522.3564 533.0522 570.3194 578.3321 597.2545 621.6555 635.3675 693.9029 716.1643 744.4279 746.7738 748.7587 752.5112 801.6982 803.3250 830.2374 846.2534 863.8248 868.6505 882.6493 889.6474 908.5326 913.3214 937.3916 963.2467 975.8140 986.3262 987.3518 1019.0716 1044.2540 1046.6321 1063.6751 1092.6448 1100.2300 1104.8194 1121.4696 1127.1767 1158.2035 1166.2843 1183.5731 1195.9269 1225.7215 1238.7554 1252.1971 1266.7444 1291.6227 1293.2954 1298.4483 1300.8054 1309.0977 1328.4979 1354.5644 1355.1399 1357.8347 1375.0272 1387.5826 1392.0979 1395.1728 1403.5362 1438.9219 1461.8121 1474.6970 1476.1180 1477.9737 1479.3797 1480.7209 1484.4046 1494.7839 1501.6575 1517.2418 1544.8059 1549.1461 1584.0109 1623.6606 2975.8369 2976.8280 2983.7973 2986.7973 2994.1314 2996.2095 3028.4143 3030.2981 3049.0921 3053.3021 3073.5784 3075.0707 3082.1852 3082.3059 3146.6060 3149.7161 3162.8499 3168.8357 3169.1297 3173.8186 3182.8345
redmass: 6.0701 4.8973 5.9658 3.4136 4.3624 3.7530 3.3728 7.0242 1.9558 2.1838 4.3472 4.0519 6.6916 6.2347 1.2405 1.3367 7.1953 3.3008 3.4567 2.6150 3.5024 6.6442 6.1982 6.8280 5.0233 3.9618 3.8022 3.7928 3.4727 3.4170 6.6024 2.5384 4.5737 7.3437 4.4931 4.2061 5.9709 6.5766 5.6331 4.1348 3.8096 2.5168 1.2236 1.2774 1.3462 1.2716 1.7142 6.2974 1.5773 1.2533 1.7162 1.5181 7.2998 1.4377 1.3433 1.3592 2.8636 2.4721 1.4120 6.9157 3.0454 2.8925 1.7473 1.8428 2.1188 2.1284 1.7550 1.5320 1.7104 1.8864 1.6577 2.3200 1.4913 1.3951 1.3169 2.7055 1.1501 1.1394 1.2879 1.3227 1.4972 4.7737 3.9767 1.3671 1.5069 4.6964 5.1108 1.2102 1.2193 2.3008 2.5572 2.7327 1.1470 1.0557 1.0441 1.0518 1.1275 1.0888 1.1075 1.4035 2.0472 6.1349 6.9550 8.6584 6.4025 1.0367 1.0361 1.0597 1.0608 1.0614 1.0605 1.0988 1.0990 1.1035 1.1032 1.1020 1.1022 1.0989 1.0989 1.0880 1.0868 1.0887 1.0944 1.0925 1.0957 1.0977
irintensity: 0.0567 0.5875 0.3185 0.0980 0.8392 0.2393 0.2185 0.7879 0.1909 0.0791 0.2552 0.0960 0.0737 0.0505 0.1207 0.2209 0.5303 1.1329 2.5175 0.7488 1.5834 0.1962 0.1581 0.8353 4.6108 1.0915 4.3420 5.2676 6.4109 9.7812 29.6987 27.5638 23.7456 22.6165 1.8457 1.4083 1.6806 4.6646 16.6687 0.1456 2.7794 10.6281 6.0043 10.0141 48.4595 0.4649 60.6154 73.6836 0.5011 1.5917 24.9819 4.9473 45.9102 19.8568 2.4675 3.9092 61.1072 0.9214 2.9739 84.8599 0.7649 5.6349 30.0302 29.6238 33.5121 1.9722 9.6275 15.4782 221.9874 3.8182 110.6838 26.3722 22.5262 68.5521 2.2361 28.5604 43.9191 8.4090 0.5778 39.4225 73.9243 733.6184 4.9875 5.6446 37.3544 3.9837 3.9808 21.4514 21.0720 162.9257 106.0075 4.7740 0.6321 1.2985 10.4895 11.3161 10.7800 0.4416 40.3646 46.3003 78.6186 41.1422 80.4310 37.0186 686.1339 36.2258 42.9199 4.7266 23.0299 86.2353 79.5788 5.3056 0.7527 4.1074 4.7029 42.4581 117.8220 23.8977 50.7806 5.3755 6.8951 2.6912 17.8320 7.6640 29.2843 3.9580
temp: 298.150 k
press: 1.00000 atm
elementType: 17 17 7 7 7 6 6 6 6 6 6 6 6 6 6 6 6 6 6 6 6 6 6 1 1 1 1 1 1 1 1 1 1 1 1 1 1 1 1 1 1 1 1 1
symmnumber: 1
zpe: 921436.8 jmol-1
zpe.correction: 0.350957 hartree
zpe.thermalcorrener: 0.374537 hartree
zpe.thermalcorrenthalpy: 0.375482 hartree
zpe.thermalcorrgfe: 0.293415 hartree
zpe.sumelectzpe: -1781.157980 hartree
zpe.sumelectthermal: -1781.134400 hartree
zpe.sumelectthermalent: -1781.133455 hartree
zpe.sumelectthermalfe: -1781.215522 hartree
dipole: -8.1681 0.1474 0.0191
dipole: 8.1695
quadrupole: -115.0644 -148.2995 -155.3025
quadrupole: 7.3282 -1.2173 0.1301
quadrupole: 24.4910 -8.7441 -15.7470 7.3282 -1.2173 0.1301
hfenergy: -1781.508937 hartree
pointgroup: C01 [X(C18H21Cl2N3)]
dipole: -3.2126287 -0.0505387 -0.0837757 debye
polarizability: 611.7910979|-3.0491951|259.4960363|12.6509138|-20.3803109|122.9684408 unknown
InChI: InChI=1S/C18H21Cl2N3/c1-3-11-23(12-4-2)16-8-6-15(7-9-16)21-22-18-13-14(19)5-10-17(18)20/h5-10,13H,3-4,11-12H2,1-2H3
charge 0 multiplicity 1
44 atoms
Cl 3.841672 -3.115075 0.763659
Cl 6.4781 2.633744 -0.40478
N  -4.073121 0.099819 -0.133055
N  1.585352 0.516583 -0.042933
N  2.291384 -0.572774 0.187966
C  -4.793421 -1.152291 0.184321
C  -4.91073 1.268925 -0.476973
C  -2.683616 0.179274 -0.100641
C  -4.971123 -2.098247 -1.030394
C  -5.244695 2.174987 0.735512
C  -1.87424 -0.98823 0.146022
C  -1.99906 1.4248 -0.31387
C  -5.745451 -3.377638 -0.649765
C  -6.126862 3.373792 0.327345
C  -0.481629 -0.913538 0.177189
C  -0.602028 1.489001 -0.288151
C  0.18825 0.330158 -0.043244
C  3.700132 -0.362114 0.177114
C  4.549951 -1.475527 0.429665
C  4.314377 0.901697 -0.078333
C  5.70713 1.007994 -0.073389
C  5.952887 -1.351092 0.431169
C  6.550451 -0.096937 0.176974
H  -4.278093 -1.684123 1.005986
H  -5.791254 -0.876519 0.576219
H  -4.417762 1.862884 -1.269396
H  -5.853999 0.891742 -0.916436
H  -5.505971 -1.555747 -1.834628
H  -3.976947 -2.361001 -1.438485
H  -5.760844 1.569366 1.506136
H  -4.3045 2.532339 1.196312
H  -2.348527 -1.961453 0.299635
H  -2.563674 2.344341 -0.486431
H  -5.213732 -3.949978 0.133632
H  -6.754623 -3.137856 -0.264344
H  -5.868683 -4.041251 -1.523786
H  -6.365738 4.006357 1.200528
H  -5.616303 4.011207 -0.418972
H  -7.083278 3.037275 -0.115741
H  0.126359 -1.805132 0.360354
H  -0.083527 2.440166 -0.449787
H  3.658305 1.754616 -0.273091
H  6.576422 -2.227295 0.628909
H  7.637955 0.013951 0.174178
