program: Gaussian 09
title: 000292354
version: EM64L-G09RevD.01
frameworkgroup: C1[X(C16H17Cl2N3)]
method: RPBEPBE
basis: SDD
operation: Freq
keyword: #p
keyword: freq=noraman
keyword: PBEPBE/SDD
title: #p freq=noraman PBEPBE/SDD
converged: YES YES NO NO
title: Mulliken charges:
elementType: Cl Cl N N N C C C C C C C C C C C C C C C C H H H H H H H H H H H H H H H H H
charge: -0.029827 -0.066308 -0.166417 -0.108573 -0.111143 -0.075081 0.436704 -0.667510 -0.682770 -0.662065 -0.343005 -0.326732 -0.362760 -0.309213 0.141928 0.302346 -0.294820 -0.247969 -0.078799 -0.195437 -0.240239 0.222283 0.217329 0.212107 0.238999 0.205771 0.227512 0.232587 0.236623 0.230430 0.245324 0.243522 0.224201 0.248200 0.282189 0.302009 0.258480 0.260124
chargesum: 0.00000
title: Mulliken charges with hydrogens summed into heavy atoms:
elementType: Cl Cl N N N C C C C C C C C C C C C C C C C
charge: -0.029827 -0.066308 -0.166417 -0.108573 -0.111143 0.147202 0.436704 0.000925 -0.016900 0.050311 -0.099484 -0.102531 -0.114560 -0.027023 0.141928 0.302346 -0.294820 0.054041 -0.078799 0.063043 0.019885
polarizability: 5.79182606e+02 -1.40869845e+01 2.32625595e+02 -7.01401858e-01 6.55310091e-01 1.02745996e+02
1716.lowfreq: -7.7384 -2.7995 -0.0015 -0.0010 -0.0002 6.2204 14.1348 22.3668 36.5304
frequency: 13.6116 21.9996 36.5183 41.5573 60.2294 86.2887 96.9812 113.8627 147.9150 150.7446 170.3781 190.4380 214.6517 218.7224 229.4936 234.1412 253.4730 302.1435 309.5086 311.4626 340.7853 364.5329 393.5204 409.9976 431.8785 442.3959 459.5068 465.2637 483.8186 526.9875 554.6162 572.8039 579.1430 620.6534 631.9269 679.4497 716.1299 727.3166 745.3929 801.6944 804.2786 829.9057 843.0303 847.7623 908.3159 913.1965 914.1980 932.1358 937.6169 941.7915 964.4518 984.9041 987.3564 1019.5622 1043.1445 1064.4211 1105.3267 1119.0608 1126.2006 1130.7138 1135.9336 1157.7994 1170.1921 1185.9490 1226.1115 1227.7377 1265.5438 1304.8101 1316.6106 1328.9376 1349.7043 1354.2573 1372.1469 1378.6667 1386.4017 1391.7534 1396.3245 1438.8701 1445.3535 1460.3384 1464.0132 1464.3699 1476.1562 1478.5566 1489.2209 1497.8227 1512.2775 1544.4414 1549.5254 1583.8861 1622.3101 2959.6193 2980.3121 2986.5317 3034.6663 3039.1266 3075.2162 3086.1087 3086.3979 3092.4430 3108.6241 3147.3598 3149.3357 3162.4113 3168.8515 3169.3163 3174.9604 3182.5188
redmass: 4.3825 3.2198 7.0127 4.2892 3.0203 6.0073 6.3809 5.5809 2.7474 5.1321 1.6149 2.2375 1.5330 2.8668 3.7953 3.0731 1.7856 4.2573 9.7688 6.2681 2.6483 4.7708 3.5213 3.6860 4.0377 3.4498 3.4909 4.2812 4.7991 2.5755 4.1958 7.1160 4.3522 4.7447 6.7831 4.6705 4.1439 5.8330 4.1376 1.3498 1.2896 1.9016 2.8098 5.5128 5.6757 1.4333 1.4087 1.9790 1.3439 1.4173 1.3513 2.7530 1.3460 6.9658 1.9766 1.7496 1.3052 1.6170 1.7048 1.6817 2.2131 1.6005 2.0834 1.7132 1.7449 2.2070 2.7026 1.4783 1.4328 5.1948 1.7948 3.8155 4.8652 1.2055 2.6098 2.6055 1.2704 2.3816 1.2459 1.6523 1.4660 1.1506 1.0557 1.0538 1.0540 1.2213 2.3640 6.2662 6.9669 8.6288 6.4378 1.0412 1.0355 1.0361 1.0853 1.0967 1.0998 1.1003 1.0986 1.1004 1.0960 1.0881 1.0866 1.0888 1.0920 1.0951 1.0954 1.0978
irintensity: 0.1135 0.2312 0.8387 1.0415 0.3736 0.6720 0.0640 0.1357 0.8651 1.0227 2.8553 0.2428 0.6585 0.1368 0.8249 2.7257 0.8011 0.9219 0.2548 0.0942 4.3740 2.4934 2.4626 2.2840 25.4177 2.3719 12.6764 12.9791 8.4603 25.4799 13.9933 22.1473 1.0092 6.7085 1.8676 24.5430 0.4395 5.1471 2.0394 46.6705 3.2114 61.2779 49.0287 35.6188 43.2365 16.1759 14.1957 16.2032 2.4394 0.4906 2.2755 0.4060 3.0085 82.0732 54.0564 31.2767 1.4236 42.6405 10.9913 211.0164 12.3553 126.1049 3.8077 118.6072 25.4420 48.2200 17.4203 116.0464 31.7343 648.9957 79.9848 3.4475 20.3410 26.1483 26.2383 146.2468 4.6525 96.2155 23.6951 6.2757 0.3391 5.4462 2.8960 17.3936 6.6833 13.0199 179.3315 33.9527 71.1573 33.3851 623.0906 116.8238 24.7362 50.0415 3.6963 26.4368 3.1959 49.3103 43.8942 41.7438 27.9239 5.8048 8.4253 2.5840 10.8579 13.3396 22.8784 3.8149
temp: 298.150 k
press: 1.00000 atm
elementType: 17 17 7 7 7 6 6 6 6 6 6 6 6 6 6 6 6 6 6 6 6 1 1 1 1 1 1 1 1 1 1 1 1 1 1 1 1 1
symmnumber: 1
zpe: 772483.3 jmol-1
zpe.correction: 0.294223 hartree
zpe.thermalcorrener: 0.315208 hartree
zpe.thermalcorrenthalpy: 0.316152 hartree
zpe.thermalcorrgfe: 0.241431 hartree
zpe.sumelectzpe: -1702.709369 hartree
zpe.sumelectthermal: -1702.688384 hartree
zpe.sumelectthermalent: -1702.687440 hartree
zpe.sumelectthermalfe: -1702.762161 hartree
dipole: 7.9715 -0.1294 -0.0424
dipole: 7.9727
quadrupole: -94.8671 -135.4520 -142.3423
quadrupole: -9.5066 -0.1146 0.8985
quadrupole: 29.3534 -11.2315 -18.1218 -9.5066 -0.1146 0.8985
hfenergy: -1703.0035923 hartree
pointgroup: C01 [X(C16H17Cl2N3)]
dipole: -3.135606 0.0807847 0.0176776 debye
polarizability: 578.8593081|-16.6897691|225.0646191|-5.7258676|31.0541586|110.6302703 unknown
InChI: InChI=1S/C16H17Cl2N3/c1-11(2)21(3)14-7-5-13(6-8-14)19-20-16-10-12(17)4-9-15(16)18/h4-11H,1-3H3
charge 0 multiplicity 1
38 atoms
Cl 3.076868 -3.146296 -0.825763
Cl 6.08982 2.358109 0.585725
N  -4.610961 0.565597 0.152217
N  1.065852 0.591928 0.116631
N  1.69944 -0.534058 -0.145653
C  -5.436118 -0.676122 0.077267
C  -3.217401 0.531658 0.133418
C  -5.907647 -0.953984 -1.371496
C  -6.618198 -0.649536 1.075126
C  -5.304385 1.864541 0.164738
C  -2.455084 1.721187 0.396198
C  -2.483276 -0.675196 -0.158268
C  -1.05595 1.696125 0.382395
C  -1.088197 -0.690956 -0.169361
C  -0.341254 0.497262 0.104213
C  3.119319 -0.417818 -0.124248
C  3.893612 -1.574307 -0.42162
C  3.815064 0.790738 0.18409
C  5.211901 0.803406 0.186186
C  5.301591 -1.544183 -0.416223
C  5.98011 -0.344432 -0.108844
H  -4.780988 -1.503455 0.399885
H  -6.478763 -1.899153 -1.419872
H  -6.565078 -0.142879 -1.735911
H  -5.046971 -1.030894 -2.059059
H  -7.405724 0.066982 0.780938
H  -7.083528 -1.650815 1.111609
H  -6.271927 -0.394433 2.092227
H  -5.28051 2.346607 1.16273
H  -6.358526 1.725035 -0.118858
H  -4.849374 2.557824 -0.566244
H  -2.962993 2.65817 0.637799
H  -3.013402 -1.598676 -0.407354
H  -0.478428 2.602177 0.595102
H  -0.537627 -1.607972 -0.401815
H  3.216179 1.677165 0.411522
H  5.866508 -2.450885 -0.649857
H  7.072546 -0.307255 -0.09947
