program: Gaussian 09
title: 000292331
version: EM64L-G09RevD.01
frameworkgroup: C1[X(C13H11NO2)]
method: RPBEPBE
basis: SDD
operation: Freq
keyword: #p
keyword: freq=noraman
keyword: PBEPBE/SDD
title: #p freq=noraman PBEPBE/SDD
converged: YES YES NO NO
title: Mulliken charges:
elementType: O O N C C C C C C C C C C C C C H H H H H H H H H H H
charge: -0.448282 -0.265015 -0.509548 0.472738 0.457781 -0.438437 -0.372333 0.259690 -0.339143 -0.333063 -0.441580 -0.382170 -0.195556 -0.216960 -0.257157 0.099848 0.302184 0.227751 0.268790 0.269804 0.271736 0.230947 0.268836 0.228255 0.228423 0.231839 0.380623
chargesum: 0.00000
title: Mulliken charges with hydrogens summed into heavy atoms:
elementType: O O N C C C C C C C C C C C C C
charge: -0.067659 -0.265015 -0.207363 0.472738 0.457781 -0.210686 -0.103544 0.259690 -0.069340 -0.061327 -0.210633 -0.113334 0.032699 0.011463 -0.025318 0.099848
polarizability: 3.14501824e+02 -3.54077827e+00 1.46262696e+02 -9.07772475e+00 -2.45906814e+00 7.23993009e+01
1716.lowfreq: -10.5952 -4.3894 -0.0003 0.0009 0.0010 8.7260 38.1051 43.0376 67.7149
frequency: 37.8953 42.9896 67.7120 93.2314 124.8136 168.8296 228.5853 260.9131 269.5043 332.7027 406.5460 413.1369 417.3584 480.4198 485.9823 494.8165 546.1487 572.2355 578.6947 611.4180 616.4175 639.9641 682.9918 694.0537 723.4007 754.2477 758.5684 805.5361 826.6590 840.1375 857.4343 871.0412 905.5050 966.0856 979.9096 984.3555 985.0449 992.1477 994.8729 1016.3737 1025.9894 1086.9182 1128.1896 1152.1939 1172.5223 1188.2987 1202.1929 1229.1609 1271.3389 1317.6991 1322.0499 1331.1340 1369.6000 1386.2490 1432.2001 1447.6398 1486.4633 1498.6800 1519.7386 1578.2501 1599.1528 1610.2662 1628.9738 1638.8790 3118.7966 3119.4548 3132.7183 3144.8303 3160.1633 3160.6391 3164.2953 3173.5877 3182.8764 3532.9565 3535.0026
redmass: 6.2359 4.5365 6.2938 5.1764 5.2982 6.1401 5.4598 5.5533 5.1097 3.8502 3.1975 4.9866 3.0647 4.0689 1.9669 3.5662 1.6377 5.3882 1.2298 5.8288 5.8024 6.4288 3.5969 2.3070 3.5143 4.7367 1.8801 3.9421 1.2901 1.4911 1.5349 4.6341 1.4203 1.3835 1.3985 1.8137 2.4136 3.9992 1.3929 2.7666 2.1370 1.5674 1.3250 1.5905 1.0507 1.1184 1.1921 3.1348 1.4878 1.5904 2.3014 1.8032 2.9376 8.1704 3.2618 3.1246 2.2882 2.0829 3.3552 5.3291 4.1053 6.1143 6.4086 8.1562 1.0879 1.0894 1.0867 1.0931 1.0909 1.0951 1.0931 1.0993 1.0964 1.0753 1.0642
irintensity: 0.6504 0.4758 0.8513 0.9421 2.0804 3.0398 1.5082 2.1350 3.3433 7.1319 5.4326 11.3960 4.2402 34.2650 145.0764 8.2633 36.9248 19.7442 84.0990 4.0652 7.9324 6.2565 84.3621 23.1235 13.3654 25.9264 82.0535 7.9533 4.8837 16.1699 46.5765 2.5222 2.9606 0.8448 1.0337 3.2337 0.7037 142.0414 15.4285 227.2602 5.6935 8.7248 9.8249 238.1547 0.4710 7.9173 4.5706 5.7221 8.3507 71.6915 67.1340 177.6795 103.9867 13.7522 3.8962 21.0009 106.0488 23.5446 498.4314 5.0968 32.8681 482.3547 300.4978 241.4795 11.1924 13.3269 1.3027 25.0256 24.1930 5.5368 13.1418 6.4400 4.3400 33.7335 47.3441
temp: 298.150 k
press: 1.00000 atm
elementType: 8 8 7 6 6 6 6 6 6 6 6 6 6 6 6 6 1 1 1 1 1 1 1 1 1 1 1
symmnumber: 1
zpe: 547756.8 jmol-1
zpe.correction: 0.208630 hartree
zpe.thermalcorrener: 0.221882 hartree
zpe.thermalcorrenthalpy: 0.222826 hartree
zpe.thermalcorrgfe: 0.167551 hartree
zpe.sumelectzpe: -706.086979 hartree
zpe.sumelectthermal: -706.073726 hartree
zpe.sumelectthermalent: -706.072782 hartree
zpe.sumelectthermalfe: -706.128058 hartree
dipole: 3.8731 0.2157 -0.3309
dipole: 3.8932
quadrupole: -96.0815 -80.5585 -97.0756
quadrupole: 9.3439 0.6080 -1.7344
quadrupole: -4.8430 10.6801 -5.8371 9.3439 0.6080 -1.7344
hfenergy: -706.2956082 hartree
pointgroup: C01 [X(C13H11N1O2)]
dipole: 1.5232607 0.0913905 -0.1321146 debye
polarizability: 314.5489405|-2.6666683|146.0275653|-8.8908211|-4.5547358|72.5873159 unknown
InChI: InChI=1S/C13H11NO2/c15-13(16)10-6-8-12(9-7-10)14-11-4-2-1-3-5-11/h1-9,14-15H
charge 0 multiplicity 1
27 atoms
O  -4.553886 -1.730756 -0.333057
O  -5.270167 0.40827 0.224202
N  1.20127 1.167403 -0.033127
C  -0.130312 0.724703 -0.022687
C  2.405838 0.415707 -0.006155
C  -1.152475 1.679104 0.274785
C  -0.514471 -0.612309 -0.342143
C  -2.88249 -0.028826 -0.034805
C  -2.502326 1.307804 0.26675
C  -1.870356 -0.976002 -0.344824
C  3.572832 0.999238 -0.573559
C  2.505984 -0.855623 0.623122
C  4.808599 0.323209 -0.519799
C  3.74549 -1.528667 0.657833
C  4.903436 -0.950839 0.087592
C  -4.316712 -0.374762 -0.024466
H  1.323365 2.181285 -0.074921
H  -0.870866 2.710239 0.522364
H  0.241913 -1.347669 -0.626453
H  -3.286766 2.035341 0.499608
H  -2.162523 -1.998263 -0.601556
H  3.503722 1.97727 -1.066041
H  1.635029 -1.295694 1.116498
H  5.696471 0.788459 -0.962149
H  3.807738 -2.50537 1.150757
H  5.86174 -1.479037 0.121781
H  -5.535775 -1.885218 -0.309651
