program: Gaussian 09
title: 000292350
version: EM64L-G09RevD.01
frameworkgroup: C1[X(C11H7Cl2F6NO3)]
method: RPBEPBE
basis: SDD
operation: Freq
keyword: #p
keyword: freq=noraman
keyword: PBEPBE/SDD
title: #p freq=noraman PBEPBE/SDD
converged: YES YES NO NO
title: Mulliken charges:
elementType: Cl Cl F F F F F F O O O N C C C C C C C C C C C H H H H H H H
charge: 0.029371 0.045728 -0.160358 -0.134158 -0.167563 -0.148271 -0.128326 -0.136728 -0.319831 -0.250206 -0.273363 -0.629534 0.334522 0.114189 0.405123 -0.395950 -0.318949 -0.398862 0.399523 0.402123 0.145410 -0.274758 -0.318210 0.310109 0.298921 0.273362 0.299843 0.296357 0.361338 0.339147
chargesum: 0.00000
title: Mulliken charges with hydrogens summed into heavy atoms:
elementType: Cl Cl F F F F F F O O O N C C C C C C C C C C C
charge: 0.029371 0.045728 -0.160358 -0.134158 -0.167563 -0.148271 -0.128326 -0.136728 -0.319831 -0.250206 -0.273363 0.070951 0.334522 0.114189 0.405123 -0.085840 -0.020028 -0.125500 0.399523 0.402123 0.145410 0.025085 -0.021853
polarizability: 2.08651751e+02 -9.12879327e+00 1.72794279e+02 -1.21325066e+01 -8.72509381e-01 9.49561612e+01
1716.lowfreq: -6.8705 -5.7845 -0.0022 -0.0008 0.0013 3.8401 10.3525 17.5227 32.4809
frequency: 8.4348 17.3769 32.4659 38.5226 53.4937 55.7660 58.1655 75.1462 90.0917 101.8405 118.9827 159.3982 184.0763 208.5452 210.2303 227.9482 250.2375 270.7728 280.6547 287.4674 297.7324 317.1396 353.2848 359.2052 373.2553 420.1053 442.1019 453.4196 466.7889 472.5668 495.9376 544.3917 556.1989 578.1598 588.9639 605.5763 633.1092 672.1060 684.2539 691.8736 703.7206 713.9124 729.5846 743.4220 761.8465 781.6223 797.4755 863.2042 879.4614 915.7276 931.7943 955.6201 996.1855 998.6146 1002.2494 1052.4939 1055.9191 1074.6577 1082.5047 1141.6683 1144.6308 1184.4114 1195.9463 1215.2960 1234.3012 1235.4372 1268.5098 1310.2003 1311.1549 1356.6562 1379.6569 1415.2930 1483.0153 1566.6646 1590.9013 1619.0162 1633.7731 3119.1739 3123.2192 3162.7991 3185.0803 3210.2316 3507.6540 3662.1486
redmass: 15.4139 18.5169 14.1417 12.5902 12.5650 15.3187 8.2222 9.9241 8.1639 7.6901 15.9027 13.6121 9.0187 13.9213 11.2482 9.3377 9.2648 11.0548 12.6905 8.0216 8.8185 12.5759 8.0189 11.2487 14.0631 7.6508 4.0460 8.4051 10.6204 7.5698 11.9382 5.5868 3.3654 5.4381 6.1841 1.8478 1.2233 3.4933 7.3271 4.7848 4.7975 6.8469 7.1921 7.4193 4.3890 7.4135 7.5653 1.4828 1.6354 7.0211 7.7072 7.1578 7.2907 1.4473 5.0872 4.7308 4.3844 2.5774 9.8107 1.4415 1.7807 4.7352 4.1849 3.3956 1.2676 1.1975 1.4135 1.4987 1.4533 3.3784 8.1953 4.2982 2.8342 2.9260 2.7819 6.0674 2.9149 1.0881 1.0883 1.0897 1.0966 1.0936 1.0456 1.1046
irintensity: 0.9613 0.8007 0.0124 1.3047 1.6353 0.1626 1.1785 2.1589 5.3699 0.3338 1.7951 1.0760 1.4772 6.3792 2.7144 3.1101 3.2738 0.5848 2.7263 2.9390 5.0925 3.8210 13.5702 5.5655 2.5797 4.4530 5.9503 2.5056 11.3224 7.9725 2.1994 17.7186 10.7158 5.1670 2.2628 6.5144 201.2049 74.1739 18.2967 31.1035 15.5735 5.0825 69.8071 66.2356 21.9651 69.8941 38.7962 23.7251 33.9626 83.3596 111.8036 128.9341 51.8907 1.7512 18.7115 48.5386 459.8932 207.3598 533.3708 13.6141 21.4298 32.4899 140.2119 321.5411 30.7281 8.1075 11.0778 55.9659 5.4455 216.6898 7.2733 89.9245 59.1586 101.0639 29.9310 89.6009 314.3255 4.8388 3.9759 2.4020 3.3389 3.9745 87.0691 82.5788
temp: 298.150 k
press: 1.00000 atm
elementType: 17 17 9 9 9 9 9 9 8 8 8 7 6 6 6 6 6 6 6 6 6 6 6 1 1 1 1 1 1 1
symmnumber: 1
zpe: 460757.5 jmol-1
zpe.correction: 0.175493 hartree
zpe.thermalcorrener: 0.198115 hartree
zpe.thermalcorrenthalpy: 0.199059 hartree
zpe.thermalcorrgfe: 0.118674 hartree
zpe.sumelectzpe: -2221.242252 hartree
zpe.sumelectthermal: -2221.219631 hartree
zpe.sumelectthermalent: -2221.218687 hartree
zpe.sumelectthermalfe: -2221.299072 hartree
dipole: 0.5553 -0.4479 1.3574
dipole: 1.5335
quadrupole: -144.0662 -157.5696 -144.7514
quadrupole: 11.7715 -19.3777 -1.4595
quadrupole: 4.7295 -8.7738 4.0443 11.7715 -19.3777 -1.4595
hfenergy: -2221.4177457 hartree
pointgroup: C01 [X(C11H7Cl2F6N1O3)]
dipole: -0.2191996 -0.1525406 -0.5409885 debye
polarizability: 210.2928474|6.418691|171.5689385|-9.3995669|2.8898792|94.540405 unknown
InChI: InChI=1S/C11H7Cl2F6NO3/c12-8(14)10(16,17)22-4-1-2-5(7(20)21)6(3-4)23-11(18,19)9(13)15/h1-3,8-9H,20H2
charge 0 multiplicity 1
30 atoms
Cl 4.715013 -1.504663 -1.199937
Cl -5.682053 0.985842 -0.954816
F  1.186084 -2.07505 0.766029
F  2.924821 -0.755276 1.38205
F  -2.850961 -1.556701 0.515079
F  -3.034395 -0.656588 -1.565134
F  3.636378 -3.320255 0.451056
F  -5.438495 -1.629186 -0.412281
O  1.883368 -0.351857 -0.67298
O  -2.833756 0.774676 0.279364
O  2.820887 3.774033 0.276509
N  3.625921 1.873065 -0.770548
C  0.878883 0.620056 -0.267654
C  1.246041 1.971514 -0.062695
C  -1.445064 1.098999 0.138556
C  -0.449727 0.159474 -0.187474
C  0.197905 2.867724 0.279665
C  -1.137689 2.450654 0.384724
C  2.297435 -1.327187 0.241218
C  -3.371142 -0.412258 -0.199969
C  2.627807 2.597778 -0.162537
C  3.216649 -2.339913 -0.480937
C  -4.900104 -0.385721 0.013278
H  -0.677054 -0.890627 -0.372523
H  0.485697 3.907831 0.461248
H  -1.938845 3.148993 0.639361
H  2.682582 -2.824428 -1.310845
H  -5.140597 -0.227719 1.074489
H  3.487819 0.924233 -1.116934
H  4.54779 2.30496 -0.829165
