program: Gaussian 09
title: 000292326
version: EM64L-G09RevD.01
frameworkgroup: C1[X(C8H7NS2)]
method: RPBEPBE
basis: SDD
operation: Freq
keyword: #pfreq=noraman
keyword: PBEPBE/SDD
title: #p freq=noraman PBEPBE/SDD
converged: NO NO NO NO
title: Mulliken charges:
elementType: S S N C C C C C C C C H H H H H H H
charge: 0.414133 -0.010255 -0.466611 0.568881 -0.350270 -0.270282 -0.348464 -0.258001 -0.588128 -0.225140 -0.219575 0.274323 0.244724 0.242306 0.278111 0.243055 0.236095 0.235099
chargesum: 0.00000
title: Mulliken charges with hydrogens summed into heavy atoms:
elementType: S S N C C C C C C C C
charge: 0.414133 -0.010255 -0.466611 0.568881 -0.350270 -0.270282 -0.074141 -0.013277 0.175345 0.010954 0.015524
polarizability: 1.72837686e+02 -7.16602486e+00 1.57786268e+02 -3.14914491e-02 -5.29336167e-03 5.12564303e+01
1716.lowfreq: -5.8916 -5.4348 0.0016 0.0021 0.0025 6.3708 51.5824 96.4687 120.7505
frequency: 51.2678 96.4643 120.7501 202.8563 205.3024 235.5227 283.5279 398.3596 418.3848 420.6119 446.7186 477.9050 483.6073 609.2467 640.8946 675.3014 725.3429 733.1467 774.0124 877.1431 942.5950 963.6235 998.9688 1015.6777 1041.7805 1070.5383 1120.9816 1129.0196 1149.1004 1174.5892 1260.4321 1296.2440 1336.0832 1394.0886 1419.3559 1435.7662 1448.2980 1470.3216 1476.2495 1575.4526 1602.7405 2981.7947 3077.6651 3095.4114 3134.9020 3141.8922 3155.0822 3170.7952
redmass: 1.0413 3.8354 4.6160 8.4030 7.3029 4.9668 3.4407 8.0792 3.2668 13.1260 6.3231 4.6551 8.1267 5.0372 5.7330 6.4993 5.8726 2.9039 1.4756 1.3705 6.9136 1.3784 1.3373 2.7495 3.3292 2.7324 1.2891 1.5100 2.4772 1.1272 1.6742 3.3070 3.9837 7.5366 1.2180 2.2766 2.7002 1.0435 1.1150 6.8513 6.9021 1.0319 1.1031 1.1002 1.0862 1.0901 1.0950 1.1004
irintensity: 0.0230 5.5731 0.1366 2.3541 3.2163 1.7146 4.9943 0.6266 3.3241 0.1856 6.2847 6.3627 2.0184 2.0418 4.4657 10.5827 14.0401 16.7502 75.1030 1.3311 2.0852 2.6551 0.3236 14.8797 8.5951 44.0290 0.0812 8.1017 26.2691 5.7042 11.2969 74.3899 39.7382 3.2389 20.9544 59.9608 0.6698 20.4519 27.3884 5.4999 24.9217 51.6447 22.4564 1.2058 1.2083 1.4265 9.4855 26.8513
temp: 298.150 k
press: 1.00000 atm
elementType: 16 16 7 6 6 6 6 6 6 6 6 1 1 1 1 1 1 1
symmnumber: 1
zpe: 340671.4 jmol-1
zpe.correction: 0.129755 hartree
zpe.thermalcorrener: 0.139698 hartree
zpe.thermalcorrenthalpy: 0.140642 hartree
zpe.thermalcorrgfe: 0.093439 hartree
zpe.sumelectzpe: -1159.144947 hartree
zpe.sumelectthermal: -1159.135004 hartree
zpe.sumelectthermalent: -1159.134060 hartree
zpe.sumelectthermalfe: -1159.181263 hartree
dipole: 2.1094 -3.4724 0.0011
dipole: 4.0629
quadrupole: -66.3278 -77.8595 -83.0067
quadrupole: 8.2267 0.0009 -0.0006
quadrupole: 9.4035 -2.1281 -7.2754 8.2267 0.0009 -0.0006
hfenergy: -1159.2747019 hartree
pointgroup: C01 [X(C8H7N1S2)]
dipole: -0.6634385 1.4542882 0.0004474 debye
dipolederiv: -0.2739537 -0.100884 0.0003076 -0.08267 -0.4017316 0.0000275 0.000181 -0.0006547 0.1550852 -0.4698893 0.2443821 0.0000637 0.2106584 -0.8217883 -0.0001545 0.0003483 0.0002114 -0.2348888 -0.3862516 -0.6149966 -0.0014406 -0.2351138 -0.2037088 -0.0000227 0.0015287 0.0029204 -0.2452679 -0.4329237 0.2331837 -0.0001148 0.0272307 -0.2726578 0.0001423 -0.0004493 0.00009 0.0925451 0.4894193 0.3692104 0.0000375 0.2144861 0.2659031 -0.0001024 0.000027 0.0000337 -0.0840182 0.5624603 -0.104239 0.0004094 -0.2939863 1.2014799 -0.0001137 0.0003279 -0.0007281 -0.0733843 0.1153775 -0.1511157 0.000044 0.0766232 -0.0006873 -0.0000078 0.0000597 0.0000069 -0.1062411 -0.2548188 -0.2105785 -0.0000013 -0.1899305 0.0432688 0.0000368 0.0000168 0.0000104 -0.1267349 0.4078221 0.1882054 0.0025046 0.1107209 -0.0408597 -0.0004558 0.0010141 -0.0026927 0.2433168 -0.0443626 0.2198525 -0.0000465 0.1666747 -0.0670296 0.0000593 0.0000241 -0.0000308 -0.1613897 0.0775605 0.0015548 -0.0000392 0.021387 0.1610199 -0.0000315 0.000019 0.000067 -0.143005 0.1204938 0.0622401 0.0000061 -0.0113241 0.0215058 -0.0000013 -0.0000045 0.0000292 0.1540541 0.0827721 -0.0008405 -0.0000025 0.0609226 -0.0695659 -0.0000091 -0.0000342 -0.0000459 0.1682928 0.0222557 -0.0476121 0.0077889 -0.0984584 0.0373427 0.1033555 0.074728 0.1011537 -0.0468199 0.1102335 -0.0089801 -0.0003474 0.1744097 0.0230908 -0.0026674 -0.0003071 -0.0011555 0.1371615 0.0189347 -0.0497184 -0.0091788 -0.0955173 0.0416916 -0.1000513 -0.0774966 -0.0992041 -0.0518581 -0.0364734 -0.0880603 -0.0000076 -0.1062666 0.0037211 0.0000003 -0.0000225 0.0000106 0.1627222 -0.1086563 0.0583961 0.000017 0.0501537 0.0790054 -0.0000043 0.0000398 -0.0000215 0.1604303 unknown
polarizability: 170.955422|-8.725809|159.6685327|0.0318955|0.0015526|51.2564303 unknown
InChI: InChI=1S/C8H7NS2/c1-9-8(10)6-4-2-3-5-7(6)11-9/h2-5H,1H3
charge 0 multiplicity 1
18 atoms
S  0.913265 2.019986 0.000284
S  1.969284 -2.241478 0.000542
N  1.928274 0.50107 -0.000441
C  -0.221775 -0.414586 -0.000095
C  -0.564958 0.963445 0.000095
C  1.224285 -0.693061 -0.000211
C  -1.250779 -1.385332 -0.000048
C  -1.904424 1.399883 0.000182
C  3.386326 0.660336 0.000927
C  -2.595079 -0.968178 0.000046
C  -2.918227 0.416017 0.000147
H  -0.962085 -2.442669 -0.000095
H  -2.161982 2.463904 0.000291
H  3.719364 1.213581 -0.895241
H  3.817981 -0.354517 -0.011925
H  3.721098 1.190458 0.91044
H  -3.398082 -1.712209 0.000064
H  -3.967483 0.730651 0.000235
