program: Gaussian 09
title: 000003637
version: EM64L-G09RevD.01
frameworkgroup: C1[X(C8H8N4)]
method: RPBEPBE
basis: SDD
operation: Freq
keyword: #p
keyword: freq=noraman
keyword: PBEPBE/SDD
title: #p freq=noraman PBEPBE/SDD
converged: YES YES NO NO
title: Mulliken charges:
elementType: N N N N C C C C C C C C H H H H H H H H
charge: -0.407373 -0.145831 -0.047340 -0.492792 0.220764 0.338246 0.073858 -0.334856 -0.376958 -0.244800 -0.471145 -0.224224 0.212337 0.241525 0.251628 0.235049 0.236523 0.324485 0.306002 0.304900
chargesum: 0.00000
title: Mulliken charges with hydrogens summed into heavy atoms:
elementType: N N N N C C C C C C C C
charge: -0.082888 -0.145831 -0.047340 0.118110 0.220764 0.338246 0.073858 -0.122519 -0.135432 -0.009751 -0.219517 0.012299
polarizability: 1.65385753e+02 2.76022062e+00 1.30015418e+02 1.51707627e-01 -1.03252181e-01 4.94470768e+01
1716.lowfreq: -9.4575 -2.9845 -0.0008 -0.0007 -0.0006 8.4062 60.8979 112.7551 121.9476
frequency: 60.8732 112.7463 121.9468 184.9043 187.3350 249.9464 320.3105 391.9617 428.8689 445.4058 465.2282 486.1921 542.1363 586.8259 635.2805 663.7855 724.4503 757.9339 786.5852 788.3543 839.7349 854.2346 886.0700 893.8676 958.3512 997.1596 998.6555 1034.0118 1082.5795 1139.1863 1178.1504 1209.3739 1230.3082 1254.5851 1275.9320 1298.4394 1339.2610 1387.1218 1401.2173 1413.1340 1457.9220 1493.3623 1520.8749 1571.3048 1620.1308 1689.8773 3125.1196 3132.8100 3138.2594 3148.4788 3166.7616 3370.7649 3474.2764 3601.7806
redmass: 2.2244 1.4273 3.9641 4.5964 4.3833 4.5045 4.4703 2.0110 5.4554 2.5978 1.8955 7.6998 8.1469 3.6858 5.6255 4.3778 4.9295 1.4281 7.5909 3.1086 2.4350 1.3209 1.5910 3.5643 1.3983 1.3477 6.1867 2.2258 4.9481 1.7173 1.1271 3.4597 1.8826 2.3821 2.2534 1.1466 2.1528 2.8010 1.9988 4.2648 2.1274 4.0584 3.1052 6.8989 6.1901 1.0590 1.0865 1.0885 1.0915 1.0949 1.1006 1.0434 1.0968 1.0786
irintensity: 0.1420 7.2820 4.1423 4.6385 2.4045 0.1051 8.2435 57.0394 1.6496 51.4036 76.7327 1.7036 4.3749 19.1852 5.7509 6.3646 48.4961 62.3339 3.5971 13.8372 101.5354 13.5646 16.1610 14.4525 3.5632 0.1780 5.8902 1.5068 21.4237 46.0950 1.3243 0.0547 27.3427 16.4473 6.5357 0.4696 5.4042 106.3080 1.7236 4.6546 68.9115 95.7890 55.4691 16.1578 7.9474 40.6310 4.3490 1.1142 7.1638 27.5668 24.1225 0.0606 1.4346 54.1627
temp: 298.150 k
press: 1.00000 atm
elementType: 7 7 7 7 6 6 6 6 6 6 6 6 1 1 1 1 1 1 1 1
symmnumber: 1
zpe: 401491.7 jmol-1
zpe.correction: 0.152920 hartree
zpe.thermalcorrener: 0.162944 hartree
zpe.thermalcorrenthalpy: 0.163888 hartree
zpe.thermalcorrgfe: 0.117214 hartree
zpe.sumelectzpe: -527.752937 hartree
zpe.sumelectthermal: -527.742913 hartree
zpe.sumelectthermalent: -527.741969 hartree
zpe.sumelectthermalfe: -527.788644 hartree
dipole: -3.6542 -3.2697 0.0084
dipole: 4.9035
quadrupole: -64.1794 -70.3001 -71.8298
quadrupole: -4.0955 0.1407 -0.0886
quadrupole: 4.5904 -1.5303 -3.0601 -4.0955 0.1407 -0.0886
hfenergy: -527.9058573 hartree
pointgroup: C01 [X(C8H8N4)]
dipole: 1.536238 1.1664887 0.0320014 debye
dipolederiv: -0.3384834 0.2956987 0.0116368 0.9016857 -0.7233873 -0.040932 0.042768 -0.0351774 -0.4744829 -0.1139923 -0.3448479 -0.0205462 0.791846 -0.6281194 -0.0351713 0.033903 -0.0093122 -0.2536844 0.187261 0.0279324 -0.0078158 -0.551605 0.07431 0.0279914 -0.0389544 0.0158651 -0.2538925 -0.0625222 0.0870366 0.0005099 0.2744169 -0.3834379 -0.0157675 0.0071218 -0.0127674 -0.0429163 -0.2581024 0.3063789 0.0223336 0.0268495 -0.0643372 -0.0055197 0.0111623 -0.0128385 0.0483121 0.082433 0.1253061 0.0068486 0.1413776 -0.0188248 -0.0090776 0.006982 -0.0099447 0.0984494 0.3972623 -0.3730625 -0.0224475 -1.0869037 0.9354509 0.0604198 -0.0539626 0.0443569 0.2094142 -0.0410947 -0.1579691 -0.011262 0.0283409 0.0079794 0.0088628 -0.0034293 0.013039 -0.164985 -0.0680026 -0.1335375 -0.0088854 -0.1665844 0.0702942 0.0154618 -0.0107453 0.0147957 -0.1578135 -0.0880715 0.1494118 0.0068399 0.0352011 0.0739311 0.01141 0.0006617 0.0093217 -0.148501 -0.2389451 -0.0724357 -0.0008269 0.0232416 0.1507644 0.0109385 0.0053281 0.012807 -0.0659604 0.1687705 -0.0403384 -0.0086123 -0.0139544 0.0054321 0.0083007 -0.00732 0.0086951 -0.1464385 0.0276234 0.1169308 0.0086168 0.0626086 -0.0564832 -0.0123711 0.0062487 -0.0140105 0.1527767 0.0477428 0.0366093 0.0041729 0.0986785 -0.0540863 -0.0130787 0.0076963 -0.0117814 0.1570962 0.0152087 0.1168853 0.0088275 0.0434484 -0.0331399 -0.0102889 0.0057691 -0.0115651 0.1476941 0.0274639 -0.087231 -0.0017915 -0.0975658 -0.0578952 -0.0097959 -0.0024133 -0.0101428 0.1631872 -0.1257158 0.0017647 0.0060106 -0.0025895 0.09628 -0.0033901 0.0058243 -0.0034538 0.1613169 0.0629751 -0.0450869 0.0052163 -0.1072444 0.2064778 -0.0019491 -0.0042206 0.0053311 0.3422753 0.1620147 -0.0063712 0.0341003 -0.2018975 0.2037893 -0.1433624 0.0442712 -0.095447 0.107833 0.1561749 -0.0030745 -0.0329256 -0.19935 0.1950019 0.1573196 -0.0566909 0.1022292 0.1203194 unknown
polarizability: 165.5492503|0.0139277|129.586026|-2.4224199|4.1572923|49.7129722 unknown
InChI: InChI=1S/C8H8N4/c9-11-8-7-4-2-1-3-6(7)5-10-12-8/h1-5,11H,9H2
charge 0 multiplicity 1
20 atoms
N  -2.048883 1.514504 0.141607
N  -1.957814 -0.807933 0.026747
N  -1.259179 -2.013946 -0.048198
N  -3.470532 1.483745 0.163129
C  0.188659 0.457939 0.045751
C  0.883223 -0.798715 -0.033128
C  -1.26707 0.372351 0.070678
C  0.941147 1.669769 0.094582
C  2.311523 -0.813918 -0.063407
C  2.342038 1.632618 0.064033
C  0.087776 -1.998779 -0.077283
C  3.031033 0.38529 -0.015785
H  0.441283 2.642947 0.15796
H  2.832604 -1.776305 -0.124233
H  0.56316 -2.983933 -0.138215
H  2.914383 2.565642 0.102174
H  4.125999 0.373072 -0.03885
H  -1.639495 2.44518 0.159706
H  -3.814337 0.995004 -0.678785
H  -3.789118 0.961169 0.994515
