program: Gaussian 09
title: 000292311
version: EM64L-G09RevD.01
frameworkgroup: C1[X(C5H5NO3)]
method: RPBEPBE
basis: SDD
operation: Freq
keyword: #pfreq=noraman
keyword: PBEPBE/SDD
title: #p freq=noraman PBEPBE/SDD
converged: NO YES NO YES
title: Mulliken charges:
elementType: O O O N C C C C C H H H H H
charge: -0.188199 -0.405706 -0.240846 -0.101291 0.156933 0.099695 -0.732127 -0.124184 0.127065 0.247376 0.250397 0.250421 0.272209 0.388257
chargesum: 0.00000
title: Mulliken charges with hydrogens summed into heavy atoms:
elementType: O O O N C C C C C
charge: -0.188199 -0.017449 -0.240846 -0.101291 0.156933 0.099695 0.016067 0.148024 0.127065
polarizability: 9.28362883e+01 3.31142229e+00 7.88102012e+01 -1.38031723e-03 1.53312408e-03 3.45077464e+01
1716.lowfreq: -81.1703 -6.6631 -0.0007 0.0008 0.0012 5.3032 7.6490 72.7920 155.6125
frequency: -81.1244 72.7779 155.6125 169.6288 264.8646 301.8284 411.4395 488.1222 545.8932 621.4921 635.6174 652.7466 682.6034 729.9818 803.8022 884.0960 932.7292 1005.6320 1020.5079 1043.5990 1081.0213 1161.1279 1236.7177 1281.0314 1374.1388 1403.1951 1418.0354 1455.9354 1461.0472 1572.2258 1630.8357 3000.9210 3079.4722 3124.2316 3273.5122 3522.3620
redmass: 1.0195 7.9584 5.0128 7.6453 3.5887 4.0428 7.8490 5.4544 1.5892 2.2243 5.2379 4.1298 4.6855 7.9253 1.4585 10.4451 2.5123 3.8485 5.1278 1.5129 3.0929 2.1453 1.5457 3.0823 4.0243 1.5077 3.4373 1.0435 1.1176 10.3438 8.3498 1.0375 1.0965 1.1003 1.1006 1.0643
irintensity: 0.3891 1.2349 1.9425 0.3559 10.5274 4.2637 6.1314 5.4934 46.3519 121.9464 37.9956 7.0278 14.8662 10.6439 24.1176 33.4256 34.9702 276.4884 9.3338 6.8436 10.2245 68.2191 5.7487 29.8140 75.6228 49.2354 22.0587 17.1387 4.9178 130.4597 263.3554 4.1516 7.5361 10.3975 1.6794 51.3418
temp: 298.150 k
press: 1.00000 atm
elementType: 8 8 8 7 6 6 6 6 6 1 1 1 1 1
symmnumber: 1
zpe: 254199.2 jmol-1
zpe.correction: 0.096819 hartree
zpe.thermalcorrener: 0.104332 hartree
zpe.thermalcorrenthalpy: 0.105277 hartree
zpe.thermalcorrgfe: 0.064248 hartree
zpe.sumelectzpe: -473.274698 hartree
zpe.sumelectthermal: -473.267185 hartree
zpe.sumelectthermalent: -473.266241 hartree
zpe.sumelectthermalfe: -473.307270 hartree
dipole: 0.1536 -0.7018 0.0002
dipole: 0.7184
quadrupole: -49.1927 -50.7500 -51.2351
quadrupole: -0.5759 0.0003 -0.0001
quadrupole: 1.1999 -0.3574 -0.8425 -0.5759 0.0003 -0.0001
hfenergy: -473.3715173 hartree
pointgroup: C01 [X(C5H5N1O3)]
dipole: 0.054124 -0.2774275 0.0000974 debye
dipolederiv: -0.4192482 0.1844388 -0.0000004 0.2243912 -0.5755279 -0.0000202 0.0000682 -0.0000159 -0.071189 -0.790227 0.5375644 0.0000211 0.6424219 -0.8456088 -0.0000193 -0.0000895 0.0001427 -0.4223591 -0.84212 -0.2156337 0.0000617 -0.226875 -0.8714986 0.0001139 -0.0000816 -0.0001078 -0.32426 -0.3372021 -0.0987516 -0.0000028 -0.0818831 -0.624725 0.0000001 -0.0000028 -0.0000079 -0.2459361 0.3687791 0.1069645 -0.0000136 -0.1578803 0.6177219 0.0000948 -0.0000901 0.0001749 0.0362506 -0.8310567 0.0711106 0.0000545 0.0202709 0.1433905 0. 0.0000968 -0.0000229 -0.005101 0.1305823 -0.1028671 0.0000135 0.0380941 -0.2297524 -0.0000461 0.0002732 -0.0002835 0.0340403 0.3297665 -0.2016056 -0.0000094 -0.170926 0.4739686 -0.0000067 0.0000007 0.0000272 0.0093945 2.0156038 -0.2310656 -0.0000787 -0.1505455 1.3996907 -0.00009 0.0000532 -0.0000335 0.2820462 -0.0708945 0.1054265 -0.0002096 0.0252956 0.077111 0.0000299 -0.0002348 0.0001424 0.1260624 0.0545528 -0.0159594 -0.0895255 0.0101059 0.0563364 -0.0279076 -0.0659426 -0.0580382 -0.0082792 0.0542368 -0.0160801 0.0897094 0.0100317 0.0564388 0.0278417 0.0660007 0.0580364 -0.007885 0.102806 -0.0156873 0.0000013 -0.0133663 0.0608638 0.0000074 -0.0000224 -0.0000133 0.1951461 0.2344212 -0.1078542 -0.0000216 -0.1691351 0.2615912 0.000002 -0.000029 -0.0000006 0.4020694 unknown
polarizability: 92.9799301|2.988336|78.6665593|-0.001345|0.0015642|34.5077464 unknown
InChI: InChI=1S/C5H5NO3/c1-3-4(5(7)8)9-2-6-3/h2,7H,1H3
charge 0 multiplicity 1
14 atoms
O  -0.375009 -1.524293 0.000206
O  2.336361 -1.109405 0.000252
O  2.078358 1.2122 0.000233
N  -2.146869 -0.071712 0.000259
C  -0.948547 0.686188 0.000239
C  0.135076 -0.197189 0.000163
C  -0.955421 2.182402 0.000283
C  -1.76384 -1.343367 0.000317
C  1.570763 0.060681 0.000008
H  -1.994991 2.544597 -0.00075
H  -0.428361 2.582645 0.884257
H  -0.426452 2.58272 -0.882501
H  -2.377349 -2.239357 0.000344
H  3.299381 -0.856812 0.000392
