program: Gaussian 09
title: 000292390
version: EM64L-G09RevD.01
frameworkgroup: C1[X(C19H12O7S)]
method: RPBEPBE
basis: SDD
operation: Freq
keyword: #p
keyword: freq=noraman
keyword: PBEPBE/SDD
title: #p freq=noraman PBEPBE/SDD
converged: YES YES NO NO
title: Mulliken charges:
elementType: S O O O O O O O C C C C C C C C C C C C C C C C C C C H H H H H H H H H H H H
charge: 0.984084 -0.260003 -0.379526 -0.407698 -0.564568 -0.242931 -0.503618 -0.499160 0.184998 0.185886 0.128310 0.206027 0.184757 0.207730 -0.356653 0.091678 -0.312783 -0.298616 -0.106402 -0.502682 -0.517097 -0.324533 -0.429142 -0.214892 0.322581 -0.350733 0.154019 0.310165 0.263030 0.261907 0.296223 0.286689 0.275091 0.289950 0.236861 0.260076 0.385799 0.369345 0.385832
chargesum: 0.00000
title: Mulliken charges with hydrogens summed into heavy atoms:
elementType: S O O O O O O O C C C C C C C C C C C C C C C C C C C
charge: 0.984084 -0.260003 0.006273 -0.038353 -0.178736 -0.242931 -0.503618 -0.499160 0.184998 0.185886 0.128310 0.206027 0.184757 0.207730 -0.046488 0.091678 -0.049753 -0.036709 -0.106402 -0.206459 -0.230408 -0.049443 -0.192281 0.075058 0.322581 -0.090657 0.154019
polarizability: 3.53532476e+02 5.60637667e+01 3.95448586e+02 2.65162152e+01 1.12533321e+01 1.68496857e+02
1716.lowfreq: -2.6725 -0.0013 -0.0008 0.0006 2.3234 4.3277 19.5052 22.4693 40.6997
frequency: 19.4359 22.4177 40.6966 57.6749 61.5617 83.2257 95.7746 100.2249 145.4568 155.8438 159.1713 174.2024 178.8603 211.2167 236.7250 247.5297 252.0615 272.0423 292.5010 306.3956 311.1723 326.9425 333.6054 359.9413 374.2688 400.7759 414.3544 417.6835 429.9743 432.5721 451.8136 458.4122 471.6251 480.0186 517.5928 546.5945 563.9451 576.9057 590.8566 606.6004 614.3103 618.6214 624.2962 652.0895 681.9873 718.8210 721.5922 737.5171 740.4683 758.0295 800.0982 805.6086 828.3530 833.1982 843.9589 869.0885 876.5965 884.2111 896.9651 920.4022 930.7212 947.5588 959.0489 965.9221 975.6880 990.9391 1048.6030 1066.9949 1074.3681 1094.4916 1105.4472 1142.0124 1152.0748 1156.9623 1181.5623 1189.1691 1213.9721 1239.6966 1253.8738 1285.7376 1289.7282 1295.3671 1332.1702 1369.7026 1378.8700 1383.8160 1418.0274 1432.7382 1446.0865 1465.4208 1492.0733 1501.1146 1546.1490 1562.0991 1564.1050 1574.2283 1615.2540 1617.0976 1651.7703 3135.3813 3140.0105 3154.2584 3164.3563 3167.2319 3171.2630 3180.0450 3185.5942 3193.3729 3480.5079 3515.2562 3579.0845
redmass: 9.2510 9.2888 8.2266 7.0112 5.6692 5.9494 6.3864 8.1557 8.1845 5.2108 6.3556 2.2258 3.0422 6.1425 6.1115 6.3619 6.4554 5.2320 4.6992 6.8387 6.9261 7.6937 8.6924 8.5871 6.9683 1.1278 7.7222 6.3951 2.0151 3.0620 4.4361 2.9747 1.8911 4.1189 4.8627 8.8648 7.2420 8.9610 6.4826 5.6149 4.4191 7.2262 6.3435 3.6198 6.6967 3.7228 7.1421 7.8575 4.3294 3.7169 3.6562 1.9121 1.4734 11.6936 1.4654 1.5414 1.7660 3.9753 3.1612 4.0615 1.8740 1.3469 3.1944 11.1398 1.3972 1.2813 1.1924 2.1409 3.1298 2.2770 1.7385 1.5100 1.4163 1.3652 1.9150 2.0857 1.4542 1.8836 2.0871 1.9299 1.7774 3.2057 2.7488 2.7727 3.1080 5.7045 4.6625 5.7987 4.6461 3.0439 5.5712 4.3938 7.1957 8.2299 6.9648 7.8605 6.8248 6.8745 7.6323 1.0899 1.0872 1.0930 1.0899 1.0978 1.0947 1.0930 1.0970 1.0934 1.0661 1.0653 1.0662
irintensity: 1.7683 2.5233 2.2889 0.3263 0.0870 0.3949 0.5030 1.9218 1.4401 10.4080 3.5288 24.4762 21.3256 8.1770 6.9003 0.4648 3.7261 30.8995 44.7320 9.1036 6.9067 5.1295 0.7277 6.2914 2.1509 132.0086 70.9532 44.3153 14.8701 15.9500 2.6502 8.1622 44.2622 8.9461 32.2339 144.3254 11.6108 17.1655 11.1273 22.2460 0.2096 9.4833 6.2171 19.3626 2.5826 1.7880 3.1955 0.9804 1.0260 3.0689 2.9940 33.0502 4.2716 76.8075 32.2158 20.2389 66.1445 31.8849 1.2843 6.1495 9.5277 2.7979 36.9986 91.1941 3.2777 0.7043 57.0256 81.7369 17.1286 231.1467 27.7864 130.6937 10.5923 166.2744 31.5948 31.0690 35.7174 6.1846 11.6720 110.7745 31.8913 16.2638 11.4074 104.3869 11.6984 47.9337 27.4408 20.5638 21.8672 82.1539 174.0258 133.3948 51.9354 99.8890 50.3344 58.3622 406.8908 120.0393 53.2808 9.7866 2.5184 5.0757 3.3811 8.8099 4.1130 0.3384 1.8644 1.4662 45.9264 93.0280 130.9989
temp: 298.150 k
press: 1.00000 atm
elementType: 16 8 8 8 8 8 8 8 6 6 6 6 6 6 6 6 6 6 6 6 6 6 6 6 6 6 6 1 1 1 1 1 1 1 1 1 1 1 1
symmnumber: 1
zpe: 697314.7 jmol-1
zpe.correction: 0.265593 hartree
zpe.thermalcorrener: 0.289283 hartree
zpe.thermalcorrenthalpy: 0.290227 hartree
zpe.thermalcorrgfe: 0.211539 hartree
zpe.sumelectzpe: -1653.781405 hartree
zpe.sumelectthermal: -1653.757716 hartree
zpe.sumelectthermalent: -1653.756771 hartree
zpe.sumelectthermalfe: -1653.835459 hartree
dipole: 2.2216 4.9573 2.6616
dipole: 6.0493
quadrupole: -204.4777 -156.7640 -162.8270
quadrupole: -30.2244 -6.9623 0.4460
quadrupole: -29.7881 17.9256 11.8625 -30.2244 -6.9623 0.4460
hfenergy: -1654.0469983 hartree
pointgroup: C01 [X(C19H12O7S1)]
dipole: -0.3287311 2.2933554 -0.5448184 debye
polarizability: 327.9321491|-41.647389|416.1259652|13.387213|39.3674111|173.4198051 unknown
InChI: InChI=1S/C19H12O7S/c20-10-1-4-13-17(7-10)26-18-8-11(21)2-5-14(18)19(13)15-9-12(27(23,24)25)3-6-16(15)22/h1-9,20,22-23H
charge 0 multiplicity 1
39 atoms
S  -4.462197 1.146445 1.117341
O  3.298962 -0.241814 0.428391
O  -0.516086 -0.891573 -2.942477
O  3.600775 4.465685 1.021308
O  -4.874033 -0.499422 1.871956
O  3.32835 -5.007922 -0.087992
O  -3.706052 2.048977 2.229001
O  -5.771763 1.70746 0.35065
C  0.516969 -0.14655 -0.27199
C  1.245443 1.074845 0.041421
C  1.186452 -1.383127 -0.217792
C  -0.93002 -0.067663 -0.643134
C  2.63217 0.985201 0.398277
C  2.609608 -1.439492 0.122239
C  -1.890837 0.40432 0.283005
C  -1.377974 -0.43331 -1.952724
C  0.674767 2.382535 0.001075
C  0.535961 -2.665431 -0.456901
C  -3.230344 0.496226 -0.115939
C  3.404643 2.10914 0.722269
C  3.331943 -2.608692 0.170383
C  -2.740392 -0.316446 -2.325975
C  1.425458 3.520927 0.318946
C  -3.688793 0.146881 -1.399503
C  2.794401 3.379662 0.687472
C  1.235935 -3.848323 -0.409052
C  2.688427 -3.896409 -0.110408
H  -1.592832 0.693955 1.295926
H  -0.372882 2.498723 -0.289022
H  -0.541675 -2.671675 -0.651836
H  4.456734 2.002556 0.993822
H  4.394621 -2.600935 0.426767
H  -3.027037 -0.598627 -3.342246
H  -4.745062 0.251176 -1.664787
H  0.960084 4.512925 0.283591
H  0.743837 -4.81161 -0.581591
H  0.407657 -1.011255 -2.59747
H  3.101034 5.319134 0.982453
H  -5.55325 -0.343697 2.591545
