program: Gaussian 09
title: 000292324
version: EM64L-G09RevD.01
frameworkgroup: C1[X(C11H12N2O2S)]
method: RPBEPBE
basis: SDD
operation: Freq
keyword: #p
keyword: freq=noraman
keyword: PBEPBE/SDD
title: #p freq=noraman PBEPBE/SDD
converged: NO YES NO NO
title: Mulliken charges:
elementType: S O O N N C C C C C C C C C C C H H H H H H H H H H H H
charge: 0.211873 -0.287982 -0.260223 -0.206752 -0.309708 0.686582 -0.424783 -0.362753 -0.483962 -0.182006 0.275137 -0.253513 -0.367209 -0.668600 0.165274 -0.500987 0.267469 0.220942 0.284335 0.246623 0.275649 0.222164 0.231606 0.245334 0.257967 0.242599 0.232216 0.242704
chargesum: 0.00000
title: Mulliken charges with hydrogens summed into heavy atoms:
elementType: S O O N N C C C C C C C C C C C
charge: 0.211873 -0.287982 -0.260223 -0.206752 -0.051741 0.686582 -0.424783 0.125659 -0.199627 -0.182006 0.275137 -0.006890 -0.091560 0.030505 0.165274 0.216533
polarizability: 2.63762224e+02 1.54122149e+00 1.65699652e+02 -3.20583833e+00 -7.55018328e+00 7.63120825e+01
1716.lowfreq: -0.0016 -0.0014 0.0022 4.6661 5.4729 9.8957 46.2043 58.9420 66.1908
frequency: 46.1685 58.9386 66.1541 82.9186 100.7813 110.1197 113.2417 154.3566 199.8660 227.0178 244.7466 274.0004 296.5329 313.1838 351.2801 381.7035 407.9170 438.4190 460.2396 488.7245 516.8182 552.8796 568.9453 601.8040 679.6773 689.9038 692.4908 714.6998 739.8577 746.1593 792.8882 817.2360 832.8009 912.4392 922.9440 964.1966 965.8065 1001.3648 1034.9593 1059.1204 1082.4024 1089.6109 1113.9194 1140.6171 1145.7654 1148.9339 1208.3247 1227.3497 1279.7557 1301.8978 1333.0500 1360.3932 1392.5457 1400.1967 1422.3552 1450.5828 1455.7459 1463.8468 1467.9285 1470.0616 1474.8013 1484.4757 1574.5272 1604.3074 1618.2329 1656.4533 2992.7123 3003.4106 3017.1696 3079.9403 3092.4879 3104.4339 3107.0805 3147.3939 3156.5880 3165.9209 3187.8537 3472.2397
redmass: 4.0881 3.8604 2.9128 1.2983 4.5934 4.5189 3.8995 4.5336 1.4799 2.4218 3.4656 7.8760 6.3000 4.0835 2.7229 5.4723 5.8726 3.4063 8.1436 5.8176 5.6134 6.6660 5.1828 5.9447 6.0530 2.8938 1.5597 5.9505 3.2940 3.9185 1.2923 4.0649 1.4063 1.5363 4.5451 1.3587 2.5483 1.9961 4.9623 2.3816 2.7710 1.9840 1.2635 1.6972 1.5461 1.5519 2.4306 2.6726 1.4902 2.4131 1.7018 1.4115 1.2256 7.8000 1.2037 1.0502 2.7285 1.0655 1.5432 1.5413 1.2957 1.0616 8.4907 7.0548 9.8136 6.7436 1.0356 1.0296 1.0633 1.1005 1.0984 1.1044 1.1027 1.1047 1.0902 1.0918 1.0954 1.0792
irintensity: 2.0125 0.8157 0.2347 2.1446 1.4428 0.1507 0.8140 3.6483 0.7887 0.7758 2.6872 0.7744 5.1475 25.8083 6.2391 23.4360 11.0923 4.0643 3.3176 6.4155 8.1874 5.3178 7.2201 8.9467 11.9069 20.1319 45.7840 42.1410 15.1727 0.6410 23.2791 9.2357 22.1996 25.2630 1.0950 0.7238 7.9934 356.1012 6.8766 122.8444 127.4538 3.8070 0.0431 62.6701 39.5071 38.9916 156.7671 190.3723 52.1047 112.7042 29.4187 1.0777 21.8816 32.8319 26.7908 14.0934 110.9114 16.1809 3.2191 91.4200 78.9708 20.8134 43.9802 83.2575 164.2564 438.6529 19.0494 46.7215 24.9746 6.3544 32.8122 27.0083 16.2804 16.8283 4.2464 5.3058 1.4450 47.7034
temp: 298.150 k
press: 1.00000 atm
elementType: 16 8 8 7 7 6 6 6 6 6 6 6 6 6 6 6 1 1 1 1 1 1 1 1 1 1 1 1
symmnumber: 1
zpe: 559365.5 jmol-1
zpe.correction: 0.213051 hartree
zpe.thermalcorrener: 0.228696 hartree
zpe.thermalcorrenthalpy: 0.229640 hartree
zpe.thermalcorrgfe: 0.169337 hartree
zpe.sumelectzpe: -1083.226881 hartree
zpe.sumelectthermal: -1083.211236 hartree
zpe.sumelectthermalent: -1083.210292 hartree
zpe.sumelectthermalfe: -1083.270595 hartree
dipole: -1.0580 -1.0327 0.3069
dipole: 1.5100
quadrupole: -89.2139 -97.9545 -103.6450
quadrupole: 3.6155 -0.3736 -0.4834
quadrupole: 7.7239 -1.0167 -6.7072 3.6155 -0.3736 -0.4834
hfenergy: -1083.4399324 hartree
pointgroup: C01 [X(C11H12N2O2S1)]
dipole: -0.4366004 0.3851763 -0.1180831 debye
polarizability: 263.6728939|3.4344692|165.8754522|3.3685445|-6.8936822|76.225613 unknown
InChI: InChI=1S/C11H12N2O2S/c1-3-13-8-6-7(10(14)15-2)4-5-9(8)16-11(13)12/h4-6,12H,3H2,1-2H3
charge 0 multiplicity 1
28 atoms
S  2.608641 2.144716 -0.10028
O  -3.972144 0.341954 -0.075733
O  -2.988853 -1.752436 0.204709
N  2.121872 -0.475402 0.233738
N  4.462873 -0.05178 0.207296
C  0.855381 0.122984 0.103607
C  0.900586 1.537399 -0.074732
C  2.31846 -1.93265 0.415859
C  -0.388681 -0.534272 0.142692
C  3.239326 0.37039 0.13641
C  -1.57697 0.230667 0.011641
C  -0.273392 2.297667 -0.206684
C  -1.521593 1.638654 -0.161483
C  2.290708 -2.703408 -0.919511
C  -2.868208 -0.508616 0.059625
C  -5.292779 -0.325979 -0.036462
H  3.299693 -2.055726 0.902371
H  1.537808 -2.299373 1.107066
H  -0.475589 -1.617435 0.267417
H  -0.22347 3.382212 -0.341207
H  -2.452367 2.201809 -0.260319
H  2.438901 -3.782335 -0.732629
H  1.32818 -2.575389 -1.44529
H  3.102508 -2.352833 -1.579114
H  5.204864 0.659763 0.140645
H  -5.375323 -1.059588 -0.856115
H  -6.022282 0.487222 -0.156341
H  -5.430353 -0.846118 0.926524
