program: Gaussian 09
title: 000292538
version: EM64L-G09RevD.01
frameworkgroup: C1[X(C21H18ClNO4S)]
method: RPBEPBE
basis: SDD
operation: Freq
keyword: #p
keyword: freq=noraman
keyword: PBEPBE/SDD
title: #p freq=noraman PBEPBE/SDD
converged: NO YES NO NO
title: Mulliken charges:
elementType: Cl S O O O O N C C C C C C C C C C C C C C C C C C C C C H H H H H H H H H H H H H H H H H H
charge: -0.080385 0.852807 -0.281847 -0.516297 -0.496443 -0.069986 -0.244953 -0.470746 -0.216250 0.281990 -0.324610 0.462410 -0.177307 -0.279141 -0.320497 -0.332271 -0.226184 -0.232586 -0.215324 -0.207212 -0.231833 0.373869 -0.158591 -0.344052 -0.380399 -0.225106 -0.197914 -0.256505 0.269297 0.264249 0.257500 0.223084 0.293780 0.261446 0.281165 0.271742 0.250416 0.235751 0.238493 0.248106 0.237731 0.260083 0.246381 0.224628 0.225168 0.226341
chargesum: 0.00000
title: Mulliken charges with hydrogens summed into heavy atoms:
elementType: Cl S O O O O N C C C C C C C C C C C C C C C C C C C C C
charge: -0.080385 0.852807 -0.281847 -0.516297 -0.496443 -0.069986 -0.244953 0.062800 -0.216250 0.281990 0.155973 0.462410 0.116474 -0.017695 -0.039331 -0.060529 0.024233 0.003165 0.023169 0.040894 0.005898 0.373869 -0.158591 -0.083969 -0.134018 -0.000478 0.027254 -0.030164
polarizability: 3.81662402e+02 2.19371650e+01 3.25780362e+02 7.24890243e+00 -5.20786153e+00 1.96574882e+02
1716.lowfreq: -11.6263 -4.3269 -0.0016 -0.0015 -0.0012 5.3250 9.8522 19.7733 22.7554
frequency: 8.2160 19.5953 22.5328 34.7349 41.6054 44.1762 57.2980 63.8269 69.1906 84.8245 91.7925 108.0169 119.6711 133.9401 149.5849 160.4071 176.0047 186.1283 193.7747 229.8239 239.8307 244.3303 275.4213 291.0539 305.3708 351.8651 366.3217 385.6302 407.3351 411.3650 412.6713 427.9238 445.0873 481.9475 492.7105 502.4493 531.7761 537.3488 587.5384 591.8411 605.6078 608.9646 610.7348 631.2599 665.9108 692.1981 694.0385 729.0044 758.6931 770.1717 774.7393 783.2804 789.9320 816.0771 823.4100 828.4209 836.4533 848.8437 885.0381 892.7595 906.4618 939.2025 962.7839 963.8328 978.1433 980.3592 982.2193 986.9480 989.9536 992.7697 999.3151 1002.6553 1006.0707 1021.7822 1022.6808 1039.1421 1079.3239 1083.1855 1084.7670 1101.7683 1120.8991 1166.6416 1171.9774 1176.8117 1178.0503 1179.6557 1187.3500 1191.6225 1216.8388 1221.4554 1263.2854 1282.4197 1314.4914 1316.6185 1326.6035 1372.0885 1378.7327 1384.2394 1400.2139 1420.0816 1438.1950 1444.0452 1445.6505 1454.7807 1468.5435 1476.3604 1493.0351 1562.2149 1571.7328 1592.5646 1592.9190 1601.5644 1611.4932 1737.0210 2950.7692 2982.2530 3028.9978 3057.1716 3128.0812 3132.3466 3137.0496 3142.1075 3145.7340 3154.7892 3154.8923 3155.2919 3163.9632 3164.4875 3164.5696 3172.4966 3172.8675 3178.2002
redmass: 8.8542 6.2750 3.7826 6.1806 6.3620 11.8266 4.7641 6.3857 6.1132 6.3877 8.9226 7.7918 7.5677 3.3273 3.9853 9.7597 6.9414 6.1476 3.9577 5.2496 5.5457 5.5453 6.7289 5.4692 5.7598 5.3784 6.1114 8.4429 3.1210 5.6645 3.0603 7.8672 5.7306 4.9218 5.8668 2.8883 4.1866 4.0026 6.6914 6.1434 6.5172 6.3709 6.4212 7.0018 7.2590 2.0889 1.7200 3.9806 1.6225 6.4026 1.3339 1.8575 14.4519 1.8606 2.0199 5.8823 1.3429 1.2483 1.3936 1.4491 14.8371 1.4457 1.3613 1.3998 5.7910 5.9938 1.3051 1.5286 4.7571 6.5588 5.2641 1.4707 1.3387 2.0713 2.0522 2.2352 1.5961 1.5199 1.6043 3.0551 1.7261 1.0809 1.1127 1.2614 1.0705 1.1654 1.1490 2.8659 2.8544 3.5362 1.4674 1.1414 1.3352 1.3660 1.2629 5.1773 3.7021 5.4981 1.7882 2.3794 2.3257 2.3414 1.1503 2.3777 1.8858 2.0521 1.1505 5.7763 5.5953 6.4099 5.8372 7.2095 6.2827 13.1704 1.0631 1.0560 1.0972 1.1076 1.0846 1.0854 1.0891 1.0889 1.0864 1.0908 1.0923 1.0929 1.0961 1.0953 1.0954 1.1011 1.1003 1.1011
irintensity: 1.7188 0.8741 0.4968 0.4474 0.4291 0.3975 0.3901 1.5374 0.4208 1.0765 2.0688 1.7441 2.8088 5.2172 2.0195 15.0982 1.0345 5.9572 3.3706 0.2708 4.6161 26.4637 6.0574 5.9833 3.0354 10.2861 3.8273 1.7089 3.6543 27.2338 2.2564 22.3861 8.2185 5.3327 62.4233 10.8345 19.1181 4.6762 8.9473 2.0652 32.6513 0.5316 1.0306 19.1549 85.8323 29.4260 54.4348 6.5311 89.9776 11.3461 70.8830 19.4042 83.7054 1.9111 5.6886 66.3270 4.0771 2.5006 0.5017 7.6248 74.0056 1.3532 0.1630 0.6660 5.3222 19.5798 1.0871 0.8787 14.7301 40.0119 1.9243 0.5209 0.3017 4.4646 33.1043 1.5505 4.6835 16.4467 4.1120 0.5134 5.4410 8.8563 2.2523 6.4613 0.6190 40.8431 11.5202 98.2569 79.8537 200.4438 0.5384 0.9861 1.0213 0.5445 5.0543 3.1012 1.5668 4.4393 15.8326 10.5389 12.4943 2.5636 12.1700 4.9953 20.0015 138.0515 2.2205 2.1372 1.7169 25.6647 7.8342 3.9333 91.7390 258.7441 6.9175 15.9733 3.8433 15.0650 2.6505 0.5074 12.4894 9.9779 1.8136 8.4119 7.9397 32.4424 9.8701 0.2504 21.6152 23.6491 5.0079 16.2198
temp: 298.150 k
press: 1.00000 atm
elementType: 17 16 8 8 8 8 7 6 6 6 6 6 6 6 6 6 6 6 6 6 6 6 6 6 6 6 6 6 1 1 1 1 1 1 1 1 1 1 1 1 1 1 1 1 1 1
symmnumber: 1
zpe: 887629.9 jmol-1
zpe.correction: 0.338080 hartree
zpe.thermalcorrener: 0.364983 hartree
zpe.thermalcorrenthalpy: 0.365927 hartree
zpe.thermalcorrgfe: 0.276005 hartree
zpe.sumelectzpe: -2022.613237 hartree
zpe.sumelectthermal: -2022.586334 hartree
zpe.sumelectthermalent: -2022.585390 hartree
zpe.sumelectthermalfe: -2022.675312 hartree
dipole: 7.3958 4.6739 1.2971
dipole: 8.8445
quadrupole: -136.4462 -172.6484 -188.2216
quadrupole: 5.4243 -2.5288 -2.7886
quadrupole: 29.3259 -6.8763 -22.4495 5.4243 -2.5288 -2.7886
hfenergy: -2022.9513169 hartree
pointgroup: C01 [X(C21H18Cl1N1O4S1)]
dipole: -2.2819558 -2.6134153 0.2666684 debye
polarizability: 346.1908128|55.2944099|314.9109192|-46.0018621|39.938325|242.915915 unknown
InChI: InChI=1S/C14H14NO.C7H4ClO3S/c1-3-7-13(8-4-1)15-11-12-16-14-9-5-2-6-10-14;8-7(9)5-3-1-2-4-6(5)12(10)11/h1-10H,11-12H2;1-4H
charge 0 multiplicity 1
46 atoms
Cl -0.54389 0.51296 3.486037
S  -0.95063 0.529498 -0.179149
O  3.480004 0.110293 -1.245256
O  -1.252688 0.418853 -1.789507
O  -0.386037 1.927932 0.454521
O  -2.037084 2.780617 3.151306
N  0.348143 -1.11603 0.314689
C  1.422177 -0.950391 -0.710576
C  -2.608777 0.220772 0.688989
C  -0.44623 -2.299338 0.204272
C  2.370847 0.176162 -0.28155
C  -2.881711 0.83807 1.927052
C  -3.570863 -0.497951 -0.035521
C  -0.571021 -3.082799 -0.983171
C  -1.119993 -2.714107 1.391154
C  -4.202575 0.728321 2.43861
C  -4.869146 -0.629326 0.507605
C  -1.334988 -4.265915 -0.966848
C  -1.884336 -3.897106 1.395957
C  -5.179979 -0.013652 1.740745
C  -1.993962 -4.676755 0.218685
C  4.528853 1.03604 -1.097662
C  -1.915073 1.630327 2.754285
C  4.574755 2.035417 -0.094426
C  5.579275 0.914574 -2.04096
C  5.684942 2.91103 -0.046401
C  6.677317 1.79464 -1.978203
C  6.738405 2.798834 -0.98006
H  1.992698 -1.898287 -0.746015
H  1.036738 -0.755797 -1.734732
H  1.878777 1.166946 -0.317846
H  2.736212 -0.00558 0.748143
H  -3.314737 -0.905272 -1.018772
H  -0.076995 -2.766208 -1.906987
H  -0.998382 -2.106886 2.294133
H  -4.449444 1.221005 3.38442
H  -5.632201 -1.191148 -0.039755
H  -1.422491 -4.869076 -1.877163
H  -2.384918 -4.217608 2.315791
H  -6.189696 -0.094976 2.155846
H  -2.584019 -5.599851 0.224174
H  3.766617 2.144542 0.634612
H  5.512855 0.134232 -2.805562
H  5.718595 3.685546 0.728156
H  7.487014 1.697983 -2.710288
H  7.592839 3.482161 -0.934272
