program: Gaussian 09
title: 000292323
version: EM64L-G09RevD.01
frameworkgroup: C1[X(C13H26N4)]
method: RPBEPBE
basis: SDD
operation: Freq
keyword: #pfreq=noraman
keyword: PBEPBE/SDD
title: #p freq=noraman PBEPBE/SDD
converged: YES YES NO NO
title: Mulliken charges:
elementType: N N N N C C C C C C C C C C C C C H H H H H H H H H H H H H H H H H H H H H H H H H H
charge: -0.430735 -0.157768 -0.077297 -0.612903 -0.385462 -0.384481 -0.372221 -0.381634 -0.366694 -0.372820 -0.399839 -0.353194 -0.495943 -0.356548 0.275517 -0.696603 0.004631 0.195165 0.195792 0.191831 0.192936 0.190812 0.187472 0.192407 0.192952 0.197560 0.216862 0.189451 0.188812 0.181270 0.213934 0.187746 0.187999 0.227242 0.242373 0.194553 0.194604 0.209816 0.214835 0.209711 0.319197 0.321805 0.326858
chargesum: 0.00000
title: Mulliken charges with hydrogens summed into heavy atoms:
elementType: N N N N C C C C C C C C C C C C C
charge: -0.111539 -0.157768 -0.077297 0.035760 0.005495 0.000286 0.006063 0.003726 0.047727 0.005443 -0.004635 0.022552 -0.026329 0.032608 0.275517 -0.062241 0.004631
polarizability: 1.90619352e+02 1.16336826e+01 1.66438903e+02 -5.07434610e+00 -3.64404914e+00 1.43901848e+02
1716.lowfreq: -7.3818 -1.2421 -0.0008 0.0008 0.0008 3.4213 16.0502 22.8131 29.6238
frequency: 15.1847 22.4139 29.1846 38.2822 43.1712 67.3243 76.1377 102.9388 110.2863 115.9878 142.9607 147.4224 161.0534 180.3754 203.7522 231.2735 237.6056 288.7552 307.0297 317.2192 334.3713 380.2716 390.8785 404.4705 450.2745 483.4400 513.0573 592.7963 626.3091 665.7587 718.8938 721.1928 723.6246 731.2593 745.1881 756.4963 792.0230 838.4005 857.2467 888.3249 902.8301 941.6298 957.0161 972.1742 986.0467 994.5370 1004.9379 1019.5201 1030.8053 1043.4197 1058.8189 1067.0342 1073.0875 1080.3874 1082.9812 1095.4605 1121.6143 1128.6374 1178.9987 1187.8829 1208.6769 1218.5560 1239.2595 1248.3564 1265.5391 1272.4795 1279.0184 1282.0798 1285.6707 1287.1905 1294.4888 1295.9550 1305.9186 1315.8762 1332.2340 1349.5657 1354.5924 1356.3318 1357.2589 1364.9363 1389.0282 1394.9123 1459.4338 1459.5835 1460.1428 1463.3533 1463.9974 1467.3102 1471.4257 1476.7520 1477.4440 1482.0675 1486.5646 1488.5993 1521.3702 1553.4136 1625.5302 2947.4130 2948.3286 2949.8013 2951.2757 2955.8972 2957.7696 2961.6047 2967.0791 2970.5820 2970.9687 2981.1551 2981.8939 2984.6980 2990.4291 2999.7031 3008.0861 3016.3258 3027.6846 3037.6007 3044.2123 3067.2244 3067.3767 3069.5779 3588.5199 3621.6404 3740.1413
redmass: 4.2108 4.5878 2.2328 2.7850 3.6818 1.8175 2.5784 3.2980 1.7408 2.6934 1.8106 2.2866 4.9117 2.5529 3.3804 1.1132 3.6768 2.3179 3.7161 1.2214 3.1870 2.3397 1.4494 2.4977 3.2383 2.9418 3.2759 2.5314 1.5477 2.5821 1.0667 1.2841 2.3240 1.2940 2.3187 1.6341 1.2888 1.4483 1.6684 1.8934 1.3033 7.2452 1.6520 2.0885 2.0381 3.6219 3.4565 1.2192 3.3943 2.9260 2.0216 2.5624 2.3996 2.0680 2.2716 2.3497 2.5832 3.4124 1.7088 1.4606 1.4655 1.3655 1.3747 1.3263 1.3090 1.4697 1.0261 1.3728 1.1737 1.0733 1.0862 1.1428 1.3276 1.5139 1.4257 1.5739 1.9191 1.9147 1.6504 1.6665 1.2172 3.7001 1.0776 1.0742 1.0965 1.0671 1.0760 1.0771 1.0820 1.0824 1.0429 1.0884 1.0925 1.0942 4.5668 1.8864 2.1326 1.0589 1.0586 1.0591 1.0593 1.0594 1.0622 1.0590 1.0587 1.0595 1.0367 1.0958 1.0678 1.0971 1.0992 1.1009 1.0995 1.1032 1.1045 1.1044 1.1040 1.0949 1.1006 1.0993 1.0443 1.0824 1.1056
irintensity: 0.0733 0.2876 0.0537 0.0533 0.0163 0.0143 0.0849 0.0535 0.0195 0.2610 0.0013 0.2888 2.1570 1.0229 0.3413 0.0073 6.4964 4.5708 1.8266 324.5010 22.1707 3.0625 2.2129 4.0966 4.1396 0.0213 2.7178 41.8914 76.8573 24.1415 16.1793 1.5679 2.7387 3.3949 0.8086 0.3628 3.2211 0.6839 1.6629 5.1841 2.8515 5.6301 0.2830 1.8404 8.9094 0.5424 0.9106 0.5308 0.3561 0.5410 2.8942 4.9977 1.9600 0.0128 1.2225 5.2128 11.8540 3.1474 2.3936 5.4573 4.9005 4.3154 0.2843 2.6456 0.1185 11.6922 0.6743 11.1122 0.1929 0.4291 0.1734 0.6157 1.3073 5.7026 3.8213 3.7315 4.4259 3.0340 0.3483 2.3542 11.1975 40.9055 1.0353 0.1926 7.9634 0.1193 0.6321 1.0017 1.3492 1.2908 12.3659 1.1451 2.4008 36.5965 113.0007 43.0524 393.7277 0.9600 0.6176 2.9233 0.3752 0.2257 15.7157 40.6553 124.1901 132.2344 42.6024 0.6010 37.7523 1.0901 0.9089 1.2614 7.1973 1.5956 5.2823 31.8407 259.4053 14.1280 107.6432 55.5304 80.2232 40.4402 46.9978
temp: 298.150 k
press: 1.00000 atm
elementType: 7 7 7 7 6 6 6 6 6 6 6 6 6 6 6 6 6 1 1 1 1 1 1 1 1 1 1 1 1 1 1 1 1 1 1 1 1 1 1 1 1 1 1
symmnumber: 1
zpe: 1000331.4 jmol-1
zpe.correction: 0.381006 hartree
zpe.thermalcorrener: 0.401616 hartree
zpe.thermalcorrenthalpy: 0.402560 hartree
zpe.thermalcorrgfe: 0.327532 hartree
zpe.sumelectzpe: -728.615861 hartree
zpe.sumelectthermal: -728.595251 hartree
zpe.sumelectthermalent: -728.594307 hartree
zpe.sumelectthermalfe: -728.669335 hartree
dipole: -0.8959 -1.2029 0.4273
dipole: 1.5595
quadrupole: -114.5066 -96.8945 -106.8243
quadrupole: 0.9938 -0.0110 -4.1815
quadrupole: -8.4315 9.1806 -0.7492 0.9938 -0.0110 -4.1815
hfenergy: -728.9968671 hartree
pointgroup: C01 [X(C13H26N4)]
dipole: 0.34351 0.4886917 0.1401773 debye
polarizability: 190.1521777|12.2835017|167.1963794|4.7310636|2.3278846|143.6115451 unknown
InChI: InChI=1S/C13H26N4/c1-2-3-4-5-6-7-8-9-10-11-12-15-13(14)17-16-12/h16H,2-11,14H2,1H3
charge 0 multiplicity 1
43 atoms
N  -4.275144 -0.06819 1.185015
N  -4.743816 -0.672736 -0.90594
N  -4.786925 -1.376876 1.32384
N  -5.585483 -2.888363 -0.386516
C  1.268467 0.590288 -0.443354
C  2.639996 0.923557 0.185613
C  0.130402 1.517898 0.038976
C  3.776369 -0.005706 -0.297426
C  -1.248649 1.143649 -0.548487
C  5.142397 0.304537 0.355302
C  -2.382206 2.080129 -0.074706
C  6.27786 -0.626919 -0.125767
C  -3.782152 1.676654 -0.612545
C  7.640737 -0.326498 0.539057
C  -4.255353 0.332844 -0.133378
C  8.768981 -1.262341 0.053866
C  -5.05394 -1.681633 0.014269
H  1.346683 0.649808 -1.54907
H  1.005188 -0.462207 -0.20811
H  2.559918 0.858414 1.29121
H  2.904678 1.977118 -0.044517
H  0.374638 2.568186 -0.226438
H  0.076874 1.482612 1.147807
H  3.501194 -1.060149 -0.084728
H  3.870815 0.07297 -1.400854
H  -1.199081 1.166712 -1.65665
H  -1.492509 0.097594 -0.273103
H  5.419192 1.358974 0.14413
H  5.046522 0.2244 1.458669
H  -2.395402 2.111756 1.035553
H  -2.166036 3.115319 -0.405976
H  5.997898 -1.682082 0.077285
H  6.382338 -0.541053 -1.227858
H  -4.523398 2.453393 -0.335625
H  -3.764254 1.631795 -1.715464
H  7.919956 0.727862 0.336298
H  7.534721 -0.412724 1.639985
H  8.526463 -2.320111 0.270288
H  9.731105 -1.028825 0.546273
H  8.917563 -1.170534 -1.038829
H  -3.980593 0.428868 2.021735
H  -5.798027 -3.604775 0.299268
H  -5.759586 -3.043513 -1.373498
