program: Gaussian 09
title: 000292325
version: EM64L-G09RevD.01
frameworkgroup: C1[X(C10H12ClNO4S)]
method: RPBEPBE
basis: SDD
operation: Freq
keyword: #p
keyword: freq=noraman
keyword: PBEPBE/SDD
title: #p freq=noraman PBEPBE/SDD
converged: YES YES NO NO
title: Mulliken charges:
elementType: Cl S O O O O N C C C C C C C C C C H H H H H H H H H H H H
charge: -0.063594 0.985295 -0.388119 -0.511692 -0.499024 -0.242619 -0.445366 -0.076645 0.510705 -0.204400 -0.220744 -0.324289 -0.423590 -0.228466 -0.535077 0.224145 -0.796076 0.283840 0.289291 0.322586 0.234286 0.227632 0.271948 0.316352 0.256735 0.280509 0.241868 0.274444 0.240064
chargesum: 0.00000
title: Mulliken charges with hydrogens summed into heavy atoms:
elementType: Cl S O O O O N C C C C C C C C C C
charge: -0.063594 0.985295 -0.388119 -0.511692 -0.499024 -0.242619 -0.129014 -0.076645 0.510705 0.079440 0.068547 -0.001703 -0.189303 0.271113 0.002167 0.224145 -0.039700
polarizability: 2.56313286e+02 -1.46479654e+01 1.59483485e+02 3.26712260e+00 1.94402079e+01 1.10127971e+02
1716.lowfreq: -62.4968 -0.0019 -0.0010 -0.0003 2.9115 7.1911 9.0077 17.7451 33.0573
frequency: -62.4911 17.6630 32.9186 41.5356 52.9767 77.1270 81.8877 101.4396 121.4980 168.2819 174.3320 180.1014 209.0911 250.3553 264.3214 301.3658 332.4216 347.1398 365.5489 394.9445 413.0618 413.6735 472.3161 509.8784 535.9110 559.4795 583.4260 609.0202 617.8873 652.6009 675.5797 723.0955 814.1505 821.1609 827.9982 832.1561 857.3007 928.1640 931.7635 960.6610 963.3072 975.9930 980.5461 988.7417 994.5565 1034.0362 1052.8938 1069.3540 1124.7644 1171.2486 1186.1380 1217.0980 1221.3773 1265.9890 1294.9496 1300.5353 1357.9323 1370.0933 1380.3499 1409.5735 1429.5231 1447.1279 1448.7681 1468.4151 1476.0524 1503.9286 1592.9711 1599.3774 1643.0935 2958.8940 2989.7836 3020.3889 3057.1702 3074.6130 3128.0843 3138.7690 3143.2993 3168.0191 3169.3414 3199.9895 3521.2868
redmass: 1.0572 7.1401 7.8991 5.3765 6.6208 5.5141 4.8417 6.8496 6.0730 5.5382 6.9109 4.9923 7.8201 5.1766 4.5340 6.4796 5.6801 4.8730 4.4371 4.6881 3.1990 4.5019 8.3849 3.5704 4.1107 5.0420 2.9151 4.7490 6.9744 1.1927 6.1781 3.3221 5.2054 2.4905 8.5208 1.4056 1.4930 6.2614 2.1993 3.2727 1.9830 2.0459 2.5707 2.4051 1.3476 1.6690 2.3984 2.4418 1.3197 1.2205 1.1261 3.3454 1.1283 1.8728 1.1744 1.4140 1.2485 3.8913 1.2497 4.9072 1.0975 1.1331 1.0686 1.0469 2.2822 2.0507 6.3817 5.5670 5.2527 1.0559 1.0386 1.1038 1.0592 1.0983 1.0903 1.0979 1.1095 1.0924 1.0946 1.0954 1.0765
irintensity: 0.0789 2.6513 1.4789 5.3689 0.8478 5.9079 1.9536 2.2171 0.6872 6.8560 5.3771 3.3337 3.2701 12.0139 1.8821 2.6135 2.4382 35.7364 3.6050 6.5939 3.2093 9.2302 65.7983 9.1785 123.0649 81.8748 2.7797 35.8425 5.9381 62.3389 3.9702 0.1675 18.6882 29.4758 93.3225 14.9700 72.3306 5.2092 38.8421 58.1770 26.8394 53.6585 22.1205 8.7781 3.3168 8.5730 45.4735 8.5912 9.3896 15.8331 30.4160 83.3941 3.3205 54.9707 8.5603 61.9680 10.3230 219.7364 77.1219 20.3924 9.8568 43.6280 20.0888 21.0060 50.6188 402.7215 108.3833 44.9791 114.4555 45.9293 6.0712 7.0037 29.1813 12.5645 12.9391 5.7598 7.2053 0.5220 10.3598 10.6219 16.6061
temp: 298.150 k
press: 1.00000 atm
elementType: 17 16 8 8 8 8 7 6 6 6 6 6 6 6 6 6 6 1 1 1 1 1 1 1 1 1 1 1 1
symmnumber: 1
zpe: 549041.7 jmol-1
zpe.correction: 0.209119 hartree
zpe.thermalcorrener: 0.226766 hartree
zpe.thermalcorrenthalpy: 0.227711 hartree
zpe.thermalcorrgfe: 0.160565 hartree
zpe.sumelectzpe: -1600.592953 hartree
zpe.sumelectthermal: -1600.575306 hartree
zpe.sumelectthermalent: -1600.574361 hartree
zpe.sumelectthermalfe: -1600.641507 hartree
dipole: -4.6254 -0.6533 -4.0055
dipole: 6.1534
quadrupole: -79.9006 -125.8952 -118.1043
quadrupole: 25.1620 3.6486 0.6577
quadrupole: 28.0661 -17.9285 -10.1376 25.1620 3.6486 0.6577
hfenergy: -1600.8020719 hartree
pointgroup: C01 [X(C10H12Cl1N1O4S1)]
dipole: -1.7454329 -0.0429807 1.6770894 debye
polarizability: 253.316662|22.5930708|156.8909893|-9.578348|23.3133868|115.7170915 unknown
InChI: InChI=1S/C10H12ClNO4S/c1-8(13)12-9-2-4-10(5-3-9)17(14,15)16-7-6-11/h2-5,12H,6-7H2,1H3
charge 0 multiplicity 1
29 atoms
Cl 2.829098 -2.63542 -0.458176
S  2.323142 1.581967 -0.3067
O  3.19464 0.370036 0.877181
O  2.813801 1.191488 -1.805543
O  2.538071 3.072723 0.279504
O  -3.798946 -1.848846 -0.740607
N  -3.470909 0.04917 0.604668
C  0.553032 1.070778 -0.031157
C  -2.108405 0.353483 0.361145
C  0.056056 -0.054064 -0.709879
C  -0.220714 1.853496 0.842746
C  -1.291369 -0.415626 -0.516533
C  -1.563408 1.485408 1.033203
C  4.326671 -0.338165 0.263624
C  4.204924 -1.828642 0.554091
C  -4.247906 -0.995473 0.07353
C  -5.689283 -1.000793 0.577266
H  0.698181 -0.63523 -1.378032
H  0.212106 2.725793 1.341484
H  -1.717766 -1.279976 -1.027171
H  -2.192194 2.080623 1.706455
H  5.262088 0.044494 0.721518
H  4.357035 -0.144673 -0.828633
H  -3.952173 0.676074 1.254658
H  5.128333 -2.358961 0.271586
H  3.947491 -2.022421 1.605241
H  -5.730388 -1.138494 1.67377
H  -6.224413 -1.832555 0.097997
H  -6.207095 -0.055693 0.329359
