program: Gaussian 09
title: 000292306
version: EM64L-G09RevD.01
frameworkgroup: C1[X(C8H10ClNO2S)]
method: RPBEPBE
basis: SDD
operation: Freq
keyword: #p
keyword: freq=noraman
keyword: PBEPBE/SDD
title: #p freq=noraman PBEPBE/SDD
converged: YES YES NO NO
title: Mulliken charges:
elementType: Cl S O O N C C C C C C C C H H H H H H H H H H
charge: -0.018552 0.976892 -0.541764 -0.521589 -0.372603 0.450114 -0.645203 -0.732887 -0.222943 -0.316326 -0.209174 -0.215696 -0.219141 0.277615 0.241793 0.240660 0.274548 0.286667 0.275041 0.256704 0.258287 0.237675 0.239882
chargesum: 0.00000
title: Mulliken charges with hydrogens summed into heavy atoms:
elementType: Cl S O O N C C C C C C C C
charge: -0.018552 0.976892 -0.541764 -0.521589 -0.372603 0.450114 0.114864 0.103368 -0.222943 -0.059622 0.049113 0.021979 0.020742
polarizability: 1.82938406e+02 1.05959798e+01 1.38513503e+02 7.91117560e+00 -3.05850525e+00 1.02221742e+02
1716.lowfreq: -3.6295 -0.0012 0.0018 0.0018 9.0422 12.8545 28.6010 54.9859 70.7654
frequency: 27.9471 54.9285 70.7616 121.7412 137.8711 151.1818 170.4296 187.6193 213.0575 221.9657 239.8236 269.5053 287.6500 334.0565 340.0919 373.6562 392.3589 461.9504 488.3473 547.4383 566.8329 596.3793 650.4476 728.3306 764.6333 779.2276 803.5646 873.5119 895.2209 958.2766 976.6373 988.1830 992.3668 1019.3093 1023.9336 1046.6005 1088.7352 1115.8006 1149.9451 1169.3663 1228.0039 1250.7546 1308.0568 1357.0306 1413.7508 1417.6604 1419.0162 1428.4623 1441.7825 1467.4769 1477.3781 1562.6490 1588.1122 2964.1024 3036.1619 3054.2430 3079.8006 3139.8886 3151.7815 3164.9316 3177.3089 3182.5399 3194.0466
redmass: 5.9109 6.9657 5.8903 1.4969 4.0323 3.7809 1.0616 2.7572 8.4791 4.2813 3.9161 5.4078 4.6689 7.9507 4.2261 7.4193 7.9210 3.5355 6.0608 4.9300 4.1909 8.0236 6.6441 3.1999 1.9622 2.3631 11.6765 1.4060 3.3541 1.3944 1.3299 2.8957 1.7029 2.5474 2.8379 2.1702 1.2752 1.6261 1.4238 1.0667 3.1739 1.6082 1.1369 8.4250 1.0705 1.6464 1.0584 1.3974 2.2518 1.0601 1.0543 6.1852 6.6056 1.0326 1.0247 1.0989 1.1020 1.0857 1.0904 1.0953 1.1006 1.1072 1.1076
irintensity: 4.1397 0.2956 1.7628 1.6740 0.6021 8.7350 0.3791 3.6646 3.6890 0.2621 3.7596 5.9888 3.6963 20.1751 7.5578 7.0215 37.9533 5.2041 10.7916 2.5879 15.1241 47.8580 9.8227 17.2554 28.0587 50.4308 56.3756 0.2438 33.4167 0.7283 36.4482 10.8590 4.6151 49.8977 19.8032 11.2150 18.7472 5.1627 8.0063 0.6848 2.6238 2.5392 5.7468 0.0192 8.4693 20.7938 11.8944 12.5799 39.2867 12.6239 16.0865 3.8855 9.0965 35.3484 0.5662 6.2993 14.7943 0.8127 6.8290 10.0386 15.0766 0.5447 0.5331
temp: 298.150 k
press: 1.00000 atm
elementType: 17 16 8 8 7 6 6 6 6 6 6 6 6 1 1 1 1 1 1 1 1 1 1
symmnumber: 1
zpe: 435348.7 jmol-1
zpe.correction: 0.165816 hartree
zpe.thermalcorrener: 0.180273 hartree
zpe.thermalcorrenthalpy: 0.181217 hartree
zpe.thermalcorrgfe: 0.123754 hartree
zpe.sumelectzpe: -1373.004934 hartree
zpe.sumelectthermal: -1372.990477 hartree
zpe.sumelectthermalent: -1372.989533 hartree
zpe.sumelectthermalfe: -1373.046996 hartree
dipole: -2.7373 -4.3890 2.3976
dipole: 5.7013
quadrupole: -84.8393 -83.9647 -95.2004
quadrupole: -7.6476 4.3492 1.8166
quadrupole: 3.1621 4.0368 -7.1989 -7.6476 4.3492 1.8166
hfenergy: -1373.1707498 hartree
pointgroup: C01 [X(C8H10Cl1N1O2S1)]
dipole: -1.2285747 1.8560195 -0.2776319 debye
dipolederiv: -0.182804 0.2016782 0.1025861 0.1315935 -0.5565959 -0.1497887 0.0574933 -0.1299915 -0.1016787 1.344869 0.0178916 0.1220178 0.2030121 1.0959868 0.1330862 0.4376834 0.0209219 1.1885195 -0.9632278 0.087701 -0.0110825 0.0551365 -0.4917052 -0.0382863 -0.0178009 -0.0751009 -0.5151142 -0.4872859 -0.0511773 0.0066935 -0.0182563 -0.4894081 0.0413226 -0.2401107 0.1260307 -0.7488173 0.0167493 0.0913905 0.1054526 -0.2102337 -0.3446533 -0.2331907 0.1034811 -0.0245582 -0.2329975 0.1895535 0.0685818 -0.0211605 0.0934674 -0.1028745 0.0380408 -0.1169269 -0.0429937 -0.1203162 -0.1733829 -0.0087793 -0.0695431 0.1946992 0.1357494 0.2052562 -0.0425411 -0.0259875 0.2335181 -0.1190998 -0.0248066 0.0050438 -0.0111694 -0.1752325 -0.023485 -0.0569202 -0.0380896 -0.0756023 0.2595367 -0.4395132 -0.1539536 -0.1414633 0.7460319 0.2406005 -0.0618711 0.2109765 0.063178 -0.0572427 0.0547028 -0.081711 -0.0760503 0.0098107 -0.0250284 -0.1288537 -0.0332216 -0.0915971 -0.2125689 0.2090133 0.0371572 0.1696245 -0.1226209 -0.0616544 0.0552938 -0.0871566 -0.1142595 -0.1129663 -0.1383979 -0.0405803 -0.1451575 0.0101665 0.0450803 0.0271694 0.0650372 -0.1051951 0.0665299 0.035636 -0.1013771 -0.010196 0.1000229 0.0277189 -0.0883201 0.0060264 -0.0954757 0.0146 0.0197822 0.047296 0.0027164 0.1179419 -0.0527026 -0.0209367 0.0227578 0.1649565 0.1350962 0.016179 -0.0503664 -0.0364134 -0.0170971 0.0597479 -0.0491016 0.0680309 -0.1196915 0.0598823 -0.0876833 -0.0639269 -0.076004 -0.0288688 -0.1256571 -0.0337057 -0.0324834 0.0014381 -0.0038496 0.0344489 0.037262 0.0110757 0.0312489 -0.0402352 0.0424799 -0.0196927 0.0897346 0.03713 -0.0040448 -0.0699662 -0.0390403 0.056155 -0.009617 -0.0792901 -0.00267 0.0496329 0.0949921 -0.0288811 0.0245083 -0.0403794 0.026165 0.0148036 0.0208884 0.0236358 -0.0014201 0.0721773 -0.0804934 0.02755 -0.0659119 -0.0246929 -0.0016136 0.0138159 0.0088136 0.1144504 0.0661161 -0.0383888 0.0214575 -0.0698798 -0.0139776 0.0059727 0.0329034 0.009246 0.1512748 0.0328097 0.0720641 0.0439758 0.0897143 -0.0451849 -0.0471904 0.0644258 -0.0425535 0.1409027 -0.0776142 -0.0069038 0.0826671 -0.0108842 0.0836325 -0.0031805 0.0807445 -0.0069777 0.1245598 unknown
polarizability: 184.009316|-3.2772773|135.0972801|-11.1167|8.8473636|104.5670541 unknown
InChI: InChI=1S/C8H10ClNO2S/c1-10(13(2,11)12)8-6-4-3-5-7(8)9/h3-6H,1-2H3
charge 0 multiplicity 1
23 atoms
Cl -0.344636 -2.330141 -0.702056
S  2.168662 0.150821 0.407435
O  3.435924 -0.493314 -0.399191
O  1.495572 -0.59347 1.691405
N  0.795755 0.700894 -0.968512
C  -0.52841 0.485566 -0.459971
C  1.170778 0.132069 -2.290673
C  2.687717 1.888622 0.982512
C  -1.191867 -0.76858 -0.307034
C  -1.241756 1.650189 -0.056909
C  -2.506619 -0.856685 0.188143
C  -2.558425 1.578572 0.438203
C  -3.193791 0.320971 0.557997
H  2.247969 -0.124193 -2.275459
H  1.010119 0.925176 -3.04392
H  0.60558 -0.772269 -2.573541
H  1.787612 2.354829 1.404387
H  3.471522 1.731187 1.736745
H  3.052929 2.41067 0.089196
H  -0.729465 2.610883 -0.174279
H  -2.979463 -1.837172 0.296731
H  -3.085019 2.493744 0.727261
H  -4.215386 0.248933 0.945327
