program: Gaussian 09
title: 000292332
version: EM64L-G09RevD.01
frameworkgroup: C1[X(C12H12N4O2S)]
method: RPBEPBE
basis: SDD
operation: Freq
keyword: #p
keyword: freq=noraman
keyword: PBEPBE/SDD
title: #p freq=noraman PBEPBE/SDD
converged: YES YES NO NO
title: Mulliken charges:
elementType: S O O N N N N C C C C C C C C C C C C H H H H H H H H H H H H
charge: 0.807436 -0.564032 -0.588666 -0.264882 -0.113673 -0.114867 -0.450887 -0.142568 -0.206517 -0.202673 0.182068 -0.326597 -0.272832 0.177908 -0.336243 -0.291594 -0.202323 -0.199009 -0.231792 0.287938 0.277331 0.261161 0.282865 0.296120 0.252879 0.276833 0.234349 0.231993 0.349773 0.356751 0.233750
chargesum: 0.00000
title: Mulliken charges with hydrogens summed into heavy atoms:
elementType: S O O N N N N C C C C C C C C C C C C
charge: 0.807436 -0.564032 -0.588666 0.031238 -0.113673 -0.114867 0.255637 -0.142568 0.081420 0.074658 0.182068 -0.065435 0.010033 0.177908 -0.083365 -0.014760 0.032025 0.032984 0.001958
polarizability: 4.78951950e+02 -3.91416431e+00 1.96104212e+02 1.26791247e+01 5.56513047e+00 1.04601164e+02
1716.lowfreq: -4.2096 0.0006 0.0019 0.0021 2.5738 8.1623 20.9026 21.6062 37.1117
frequency: 20.7960 21.0231 37.0673 43.2439 47.1030 68.1242 92.5006 98.7069 140.8690 149.3497 172.1052 216.1770 241.8062 268.2010 288.7862 325.5157 333.2493 342.5273 400.3846 406.3518 411.8289 419.6382 458.3116 499.6874 516.4609 553.0081 564.3306 607.6309 617.4274 670.5070 678.9178 690.8135 734.2090 751.1183 784.7374 808.4527 847.0492 854.4345 862.6301 876.7958 896.0796 937.0677 946.5867 982.1334 986.1433 989.6023 989.9180 995.8583 1004.6503 1014.3225 1039.3631 1076.2763 1098.4256 1133.7179 1135.6307 1154.4945 1171.6027 1179.2209 1227.4507 1235.6847 1279.1763 1306.1684 1357.8825 1386.4634 1393.0222 1401.6575 1437.1312 1444.2341 1451.9349 1465.8338 1573.6463 1581.7045 1589.4507 1602.0373 1686.8204 3131.0404 3142.2417 3152.2299 3153.8159 3154.8872 3167.4017 3171.6667 3173.8870 3174.1351 3263.3099 3401.3681 3594.2826
redmass: 4.3925 5.8856 6.3431 3.9530 4.1681 3.4032 5.7024 5.4706 8.6703 9.4545 7.9728 4.9688 6.0447 6.2809 7.1170 7.1696 3.6745 4.7819 5.5135 2.9535 2.9673 2.7159 3.4774 3.4406 6.4914 3.2805 6.5208 6.5874 7.1413 1.9499 2.8976 1.8982 3.3061 13.6828 1.7532 6.0482 1.2569 1.2471 1.5964 10.5143 6.9572 1.0940 1.4342 1.3796 6.2017 4.1861 1.3960 1.3735 1.3292 2.0856 2.5096 1.4995 1.2975 1.3772 1.6810 1.2500 1.0609 1.4938 3.3417 4.1392 1.2808 1.3954 7.1762 6.9947 10.0533 3.9508 1.3549 2.3833 2.2455 2.2701 6.9315 6.1507 7.1298 6.2549 1.0845 1.0853 1.0888 1.0885 1.0884 1.0930 1.0960 1.0963 1.0993 1.0976 1.0766 1.0499 1.0959
irintensity: 1.5483 0.7245 0.7373 4.2155 5.2986 8.5270 20.2043 17.2925 4.7683 3.3887 2.7147 43.0443 41.1322 3.9517 10.3415 0.9961 32.9410 0.1964 12.7867 0.5522 14.0694 35.7718 3.6734 3.0182 23.1156 39.6246 29.4426 0.0252 1.6256 508.0447 303.8705 55.1339 19.6755 40.7229 41.6826 0.3267 3.1219 0.3270 64.4702 68.1963 2.0727 39.6574 7.7925 2.2135 3.2650 12.3961 0.4872 2.3080 0.7156 8.8585 16.9362 9.3469 11.3809 37.2798 13.7892 22.9855 0.5077 3.4983 34.4064 228.5387 0.6109 2.1827 13.7530 6.5031 0.7799 24.0730 29.4284 9.0991 8.3650 11.4772 3.9000 3.0580 1.5054 11.4519 28.7135 1.4543 9.1159 1.8294 1.3461 20.1103 15.5706 3.7370 25.6364 10.4729 32.4823 111.6347 38.4201
temp: 298.150 k
press: 1.00000 atm
elementType: 16 8 8 7 7 7 7 6 6 6 6 6 6 6 6 6 6 6 6 1 1 1 1 1 1 1 1 1 1 1 1
symmnumber: 1
zpe: 590677.3 jmol-1
zpe.correction: 0.224977 hartree
zpe.thermalcorrener: 0.243674 hartree
zpe.thermalcorrenthalpy: 0.244618 hartree
zpe.thermalcorrgfe: 0.174438 hartree
zpe.sumelectzpe: -1230.395963 hartree
zpe.sumelectthermal: -1230.377266 hartree
zpe.sumelectthermalent: -1230.376322 hartree
zpe.sumelectthermalfe: -1230.446501 hartree
dipole: -2.1386 -3.0713 2.6514
dipole: 4.5866
quadrupole: -84.5867 -106.6914 -129.2569
quadrupole: -16.4236 12.3721 3.4941
quadrupole: 22.2583 0.1536 -22.4119 -16.4236 12.3721 3.4941
hfenergy: -1230.6209399 hartree
pointgroup: C01 [X(C12H12N4O2S1)]
dipole: -0.7823345 1.6234011 -0.0932845 debye
polarizability: 478.5202396|-0.2891982|158.0310114|-17.2773704|45.6912874|143.1060746 unknown
InChI: InChI=1S/C12H9N2O2S.H3N2/c15-17(16)12-8-6-11(7-9-12)14-13-10-4-2-1-3-5-10;1-2/h1-9H;1H,2H2
charge 0 multiplicity 1
31 atoms
S  4.519709 -0.766506 -0.283198
O  4.948703 -2.243365 -0.881999
O  4.931207 -0.32897 1.271709
N  5.765904 1.011416 -1.231006
N  -1.570186 -0.604199 -0.576831
N  -2.209395 0.174147 0.258522
N  6.282222 1.530483 -0.098571
C  2.635303 -0.690847 -0.331748
C  1.973915 -1.479051 -1.28929
C  1.965004 0.142316 0.586668
C  -0.142954 -0.580552 -0.429159
C  0.565699 -1.418423 -1.330505
C  0.560919 0.195065 0.537469
C  -3.634948 0.159552 0.119465
C  -4.335029 1.001749 1.023675
C  -4.35312 -0.618335 -0.834152
C  -5.743064 1.07057 0.979345
C  -5.757097 -0.543324 -0.871174
C  -6.456728 0.298818 0.032373
H  2.544332 -2.134809 -1.954457
H  2.536626 0.697485 1.337246
H  -0.007825 -2.011053 -2.049965
H  -0.012148 0.816803 1.231392
H  6.429539 0.291836 -1.606052
H  -3.753668 1.585705 1.744787
H  -3.792574 -1.260341 -1.520304
H  -6.281869 1.720082 1.677276
H  -6.316106 -1.138437 -1.601864
H  6.882303 0.998397 0.548436
H  5.722231 2.272395 0.326121
H  -7.550606 0.35019 -0.004213
