program: Gaussian 09
title: 000292310
version: EM64L-G09RevD.01
frameworkgroup: C1[X(C8H12ClN3O2S)]
method: RPBEPBE
basis: SDD
operation: Freq
keyword: #p
keyword: freq=noraman
keyword: PBEPBE/SDD
title: #p freq=noraman PBEPBE/SDD
converged: NO YES NO NO
title: Mulliken charges:
elementType: Cl S O O N N N C C C C C C C C H H H H H H H H H H H H
charge: -0.054450 0.969610 -0.560873 -0.521603 -0.231522 -0.429515 -0.569054 -0.297443 0.472563 -0.196646 -0.616171 -0.613813 -0.326174 -0.144639 -0.179113 0.303738 0.280157 0.217074 0.251534 0.248990 0.219864 0.264559 0.291123 0.255631 0.358650 0.304285 0.303237
chargesum: 0.00000
title: Mulliken charges with hydrogens summed into heavy atoms:
elementType: Cl S O O N N N C C C C C C C C
charge: -0.054450 0.969610 -0.560873 -0.521603 -0.231522 -0.070865 0.038468 -0.297443 0.472563 0.107092 0.132594 0.119602 -0.035051 -0.144639 0.076518
polarizability: 1.87425929e+02 -9.34389849e+00 1.77193776e+02 -7.34970824e-01 3.50521070e+00 1.04559201e+02
1716.lowfreq: -8.8187 -4.8924 -3.8995 0.0008 0.0021 0.0021 34.0784 50.2400 59.0379
frequency: 34.0673 50.0846 59.0118 89.9980 129.9567 137.3645 168.2677 189.4452 206.8083 221.9702 233.5029 240.0674 245.6311 263.8162 297.4362 304.5628 319.6608 337.2964 357.4989 376.0598 393.1530 433.0164 446.4191 492.5011 544.1888 549.4935 581.3364 644.1592 674.0392 707.9439 750.1769 789.9658 826.2336 841.0400 856.6783 880.8608 934.6319 973.8873 986.5700 1012.8587 1076.2365 1080.1993 1110.7883 1111.4803 1156.3988 1169.6819 1206.3405 1229.7287 1239.1634 1311.4255 1342.7011 1405.1937 1407.4147 1419.5389 1453.8618 1456.7758 1462.4691 1469.6116 1478.0383 1507.0952 1575.5512 1605.0707 1668.9961 2925.7861 2928.4087 3044.9866 3046.5981 3101.5131 3105.1754 3155.9671 3160.2322 3180.4609 3269.9667 3443.3932 3575.1045
redmass: 3.6999 3.8135 3.9613 4.5160 7.6985 5.5869 4.4772 4.9250 4.5332 1.1566 1.5764 3.1802 3.8253 8.3219 2.1718 2.9981 4.5168 2.0555 6.1381 3.7185 5.2093 4.6284 6.0391 4.9436 4.1262 2.5433 2.2184 5.8655 4.7566 4.1288 1.3508 15.4637 4.0246 1.4165 4.3211 1.3657 13.1462 1.3203 4.7712 1.4625 2.0576 1.2341 1.3885 1.9917 2.1514 4.7433 1.6641 1.4330 1.1754 2.1414 3.9523 2.2012 1.6575 1.1408 1.1771 1.9355 1.1138 1.0524 1.0601 2.4613 2.3981 4.1819 1.2048 1.0460 1.0450 1.0890 1.0867 1.0985 1.0989 1.0923 1.0885 1.0957 1.0820 1.0418 1.1034
irintensity: 2.0828 0.0734 2.5044 2.2171 0.6877 4.2463 2.0722 11.4415 0.3192 0.3344 1.4243 1.9872 3.1046 2.5367 17.7749 1.1272 4.5353 35.6358 8.3876 6.8029 0.3171 31.2150 73.0793 90.5452 3.7701 30.8463 180.5942 5.8736 29.3211 6.3615 106.1330 83.8872 24.6452 30.8201 40.4416 9.2050 84.6015 1.9006 19.6715 1.2100 18.2217 0.2704 24.6044 12.5709 5.2241 10.4751 13.4506 14.3273 0.7538 0.2356 26.7796 2.4634 35.5574 2.4523 99.3609 98.1915 9.4284 18.6306 38.7543 38.9806 11.1185 36.0410 51.5309 26.0999 70.7080 4.4340 34.8293 1.5428 4.3172 6.2758 2.2307 2.1032 125.9696 0.3878 5.4957
temp: 298.150 k
press: 1.00000 atm
elementType: 17 16 8 8 7 7 7 6 6 6 6 6 6 6 6 1 1 1 1 1 1 1 1 1 1 1 1
symmnumber: 1
zpe: 523145.0 jmol-1
zpe.correction: 0.199255 hartree
zpe.thermalcorrener: 0.216123 hartree
zpe.thermalcorrenthalpy: 0.217067 hartree
zpe.thermalcorrgfe: 0.154701 hartree
zpe.sumelectzpe: -1483.511643 hartree
zpe.sumelectthermal: -1483.494775 hartree
zpe.sumelectthermalent: -1483.493831 hartree
zpe.sumelectthermalfe: -1483.556197 hartree
dipole: -0.2493 3.9862 4.8122
dipole: 6.2538
quadrupole: -113.5954 -87.9001 -106.7430
quadrupole: -3.2095 -10.4949 -6.8531
quadrupole: -10.8493 14.8461 -3.9968 -3.2095 -10.4949 -6.8531
hfenergy: -1483.7108981 hartree
pointgroup: C01 [X(C8H12Cl1N3O2S1)]
dipole: -0.0492479 1.6997559 -1.7782309 debye
polarizability: 184.6711489|10.2801975|179.9442088|3.2301921|2.2236739|104.5635483 unknown
InChI: InChI=1S/C8H12ClN3O2S/c1-12(2)15(13,14)8-5-6(9)3-4-7(8)11-10/h3-5,11H,10H2,1-2H3
charge 0 multiplicity 1
27 atoms
Cl -3.796698 -1.898268 -0.302836
S  1.5237 -0.696466 0.784989
O  2.386911 0.571218 1.36694
O  1.348136 -2.073825 1.623225
N  2.440812 -1.200262 -0.79379
N  0.536242 2.319886 0.279826
N  0.201708 3.679699 0.127137
C  -0.197486 -0.043831 0.334576
C  -0.444733 1.346436 0.107086
C  -1.191567 -1.038739 0.231613
C  1.860175 -2.436105 -1.371264
C  2.54571 -0.054957 -1.728338
C  -1.773462 1.686241 -0.299893
C  -2.479688 -0.646156 -0.158602
C  -2.771593 0.708765 -0.436155
H  -0.953911 -2.07764 0.482882
H  1.691923 -3.164047 -0.560827
H  0.916824 -2.272109 -1.938044
H  2.616756 -2.858439 -2.057097
H  3.290322 -0.332548 -2.495955
H  1.590776 0.203297 -2.238312
H  2.930495 0.82219 -1.183586
H  -1.980148 2.743746 -0.483262
H  -3.781013 0.998086 -0.743916
H  1.411549 2.025622 0.751246
H  0.74767 4.156341 -0.595155
H  0.121191 4.194167 1.010417
